BDBM217085 US9302989, 380
SMILES: O=C(Nc1ccc(cc1)-c1n[nH]c(=O)c2ccccc12)N1Cc2ccc(CN3CCCC3)cc2C1
InChI Key: InChIKey=QPUSVMCWHCAZMN-UHFFFAOYSA-N
Data: 1 KI  1 IC50
Activity Spreadsheet -- Enzyme Inhibition Constant Data from BindingDB
Found 2 hits for monomerid = 217085
Trg + Lig
Ki
nM
ΔG°
kcal/mole
IC50
nM
Kd
nM
EC50/IC50
nM
koff
s-1
kon
M-1s-1
pHTemp
°C
Rho-associated protein kinase 2
(Homo sapiens (Human))
BDBM217085
(US9302989, 380)
Show SMILES O=C(Nc1ccc(cc1)-c1n[nH]c(=O)c2ccccc12)N1Cc2ccc(CN3CCCC3)cc2C1
Show InChI InChI=1S/C28H27N5O2/c34-27-25-6-2-1-5-24(25)26(30-31-27)20-9-11-23(12-10-20)29-28(35)33-17-21-8-7-19(15-22(21)18-33)16-32-13-3-4-14-32/h1-2,5-12,15H,3-4,13-14,16-18H2,(H,29,35)(H,31,34)
US Patent
2.30n/an/an/an/an/an/an/an/a
AbbVie Inc.
US Patent
Assay Description
HTRF assay: This assay used the CisBio HTRF KinEASE kit (kit 62ST2PEZ) and the kinase reaction containing 0.2 uM biotinylated substrate peptide (S2, ...
US Patent US9302989 (2016)
BindingDB Entry DOI: 10.7270/Q2HH6HX1
Nicotinamide phosphoribosyltransferase
(Homo sapiens (Human))
BDBM217085
(US9302989, 380)
Show SMILES O=C(Nc1ccc(cc1)-c1n[nH]c(=O)c2ccccc12)N1Cc2ccc(CN3CCCC3)cc2C1
Show InChI InChI=1S/C28H27N5O2/c34-27-25-6-2-1-5-24(25)26(30-31-27)20-9-11-23(12-10-20)29-28(35)33-17-21-8-7-19(15-22(21)18-33)16-32-13-3-4-14-32/h1-2,5-12,15H,3-4,13-14,16-18H2,(H,29,35)(H,31,34)
Reactome pathway
US Patent
n/an/a 201n/an/an/an/a7.5n/a
AbbVie Inc.
US Patent
Assay Description
Probe 2:The assay was carried out in 18 uL low volume plates (Owens Corning) in reaction buffer (50 mM HEPES (NaOH), pH 7.5, 100 mM NaCl, 10 mM MgCl2...
US Patent US9302989 (2016)
BindingDB Entry DOI: 10.7270/Q2HH6HX1