BDBM217095 US9302989, 390
SMILES: CCN(CC)Cc1ccc2CN(Cc2c1)C(=O)Nc1ccc(cc1)-c1c[nH]c(=O)c2ccccc12
InChI Key: InChIKey=MVLPNSPQDDEIPU-UHFFFAOYSA-N
Data: 1 KI  2 IC50
Activity Spreadsheet -- Enzyme Inhibition Constant Data from BindingDB
Found 3 hits for monomerid = 217095
Trg + Lig
Ki
nM
ΔG°
kcal/mole
IC50
nM
Kd
nM
EC50/IC50
nM
koff
s-1
kon
M-1s-1
pHTemp
°C
Rho-associated protein kinase 2
(Homo sapiens (Human))
BDBM217095
(US9302989, 390)
Show SMILES CCN(CC)Cc1ccc2CN(Cc2c1)C(=O)Nc1ccc(cc1)-c1c[nH]c(=O)c2ccccc12
Show InChI InChI=1S/C29H30N4O2/c1-3-32(4-2)17-20-9-10-22-18-33(19-23(22)15-20)29(35)31-24-13-11-21(12-14-24)27-16-30-28(34)26-8-6-5-7-25(26)27/h5-16H,3-4,17-19H2,1-2H3,(H,30,34)(H,31,35)
US Patent
2.45n/an/an/an/an/an/an/an/a
AbbVie Inc.
US Patent
Assay Description
HTRF assay: This assay used the CisBio HTRF KinEASE kit (kit 62ST2PEZ) and the kinase reaction containing 0.2 uM biotinylated substrate peptide (S2, ...
US Patent US9302989 (2016)
BindingDB Entry DOI: 10.7270/Q2HH6HX1
Nicotinamide phosphoribosyltransferase
(Homo sapiens (Human))
BDBM217095
(US9302989, 390)
Show SMILES CCN(CC)Cc1ccc2CN(Cc2c1)C(=O)Nc1ccc(cc1)-c1c[nH]c(=O)c2ccccc12
Show InChI InChI=1S/C29H30N4O2/c1-3-32(4-2)17-20-9-10-22-18-33(19-23(22)15-20)29(35)31-24-13-11-21(12-14-24)27-16-30-28(34)26-8-6-5-7-25(26)27/h5-16H,3-4,17-19H2,1-2H3,(H,30,34)(H,31,35)
Reactome pathway
US Patent
n/an/a 727n/an/an/an/a7.5n/a
AbbVie Inc.
US Patent
Assay Description
Probe 1:The assay was carried out in 18 uL low volume plates (Owens Corning) in reaction buffer (50 mM HEPES (NaOH), pH 7.5, 100 mM NaCl, 10 mM MgCl2...
US Patent US9302989 (2016)
BindingDB Entry DOI: 10.7270/Q2HH6HX1
Nicotinamide phosphoribosyltransferase
(Homo sapiens (Human))
BDBM217095
(US9302989, 390)
Show SMILES CCN(CC)Cc1ccc2CN(Cc2c1)C(=O)Nc1ccc(cc1)-c1c[nH]c(=O)c2ccccc12
Show InChI InChI=1S/C29H30N4O2/c1-3-32(4-2)17-20-9-10-22-18-33(19-23(22)15-20)29(35)31-24-13-11-21(12-14-24)27-16-30-28(34)26-8-6-5-7-25(26)27/h5-16H,3-4,17-19H2,1-2H3,(H,30,34)(H,31,35)
Reactome pathway
US Patent
n/an/a 616n/an/an/an/a7.5n/a
AbbVie Inc.
US Patent
Assay Description
Probe 2:The assay was carried out in 18 uL low volume plates (Owens Corning) in reaction buffer (50 mM HEPES (NaOH), pH 7.5, 100 mM NaCl, 10 mM MgCl2...
US Patent US9302989 (2016)
BindingDB Entry DOI: 10.7270/Q2HH6HX1