BDBM217385 Steroid scaffold, 10
SMILES: C[C@@]12CCC[C@H]1[C@@H]1CC[C@H]3CC(=O)C(Br)=C[C@]3(C)[C@H]1CC2
InChI Key: InChIKey=FBRNKWMVKROLNN-VRBUCKFRSA-N
Data: 1 IC50
Activity Spreadsheet -- Enzyme Inhibition Constant Data from BindingDB
Found 1 hit for monomerid = 217385
Trg + Lig
Ki
nM
ΔG°
kcal/mole
IC50
nM
Kd
nM
EC50/IC50
nM
koff
s-1
kon
M-1s-1
pHTemp
°C
Ghrelin O-acyltransferase
(Homo sapiens (Human))
BDBM217385
(Steroid scaffold, 10)
Show SMILES C[C@@]12CCC[C@H]1[C@@H]1CC[C@H]3CC(=O)C(Br)=C[C@]3(C)[C@H]1CC2 |r,c:15|
Show InChI InChI=1S/C19H27BrO/c1-18-8-3-4-14(18)13-6-5-12-10-17(21)16(20)11-19(12,2)15(13)7-9-18/h11-15H,3-10H2,1-2H3/t12-,13-,14-,15-,18-,19-/m0/s1
n/an/a 8.30E+4n/an/an/an/a7.025
Syracuse University
Assay Description
Assays were performed with ~100 μg of membrane protein, as determined by a Bradford assay. The membrane fraction was preincubated with 1 μM met...
Biochemistry 56: 919-931 (2017)
Article DOI: 10.1021/acs.biochem.6b01008
BindingDB Entry DOI: 10.7270/Q270808D