BDBM217431 US9212182, 423::US9212182, 424
SMILES: COc1cc(c(C)cc1-n1c2ccc(cc2ccc1=O)S(=O)(=O)Nc1ccon1)-c1cc(F)cc(F)c1
InChI Key: InChIKey=ORNDBCORCUTKLC-UHFFFAOYSA-N
Data: 5 IC50
Activity Spreadsheet -- Enzyme Inhibition Constant Data from BindingDB
Found 5 hits for monomerid = 217431
Trg + Lig
Ki
nM
ΔG°
kcal/mole
IC50
nM
Kd
nM
EC50/IC50
nM
koff
s-1
kon
M-1s-1
pHTemp
°C
Sodium channel protein type 5 subunit alpha
(Homo sapiens (Human))
BDBM217431
(US9212182, 423 | US9212182, 424)
Show SMILES COc1cc(c(C)cc1-n1c2ccc(cc2ccc1=O)S(=O)(=O)Nc1ccon1)-c1cc(F)cc(F)c1 |(-1.33,-5.39,;,-4.62,;1.33,-5.39,;1.33,-6.93,;2.67,-7.7,;4,-6.93,;5.33,-7.7,;4,-5.39,;2.67,-4.62,;2.67,-3.08,;1.33,-2.31,;,-3.08,;-1.33,-2.31,;-1.33,-.77,;;1.33,-.77,;2.67,,;4,-.77,;4,-2.31,;5.33,-3.08,;-2.67,,;-3.44,-1.33,;-1.9,1.33,;-4,.77,;-4,2.31,;-5.25,3.22,;-4.77,4.68,;-3.23,4.68,;-2.76,3.22,;2.67,-9.24,;4,-10.01,;4,-11.55,;5.33,-12.32,;2.67,-12.32,;1.33,-11.55,;,-12.32,;1.33,-10.01,)|
Show InChI InChI=1S/C26H19F2N3O5S/c1-15-9-23(24(35-2)14-21(15)17-10-18(27)13-19(28)11-17)31-22-5-4-20(12-16(22)3-6-26(31)32)37(33,34)30-25-7-8-36-29-25/h3-14H,1-2H3,(H,29,30)
US Patent
n/an/a>3.00E+4n/an/an/an/an/an/a
Amgen Inc.
US Patent
Assay Description
293 cells stably transfected with Nav 1.5 were recorded in whole cell voltage clamp mode with the PatchXpress automated electrophysiology system acco...
US Patent US9212182 (2015)
BindingDB Entry DOI: 10.7270/Q2TT4PTW
Sodium channel protein type 9 subunit alpha
(Homo sapiens (Human))
BDBM217431
(US9212182, 423 | US9212182, 424)
Show SMILES COc1cc(c(C)cc1-n1c2ccc(cc2ccc1=O)S(=O)(=O)Nc1ccon1)-c1cc(F)cc(F)c1 |(-1.33,-5.39,;,-4.62,;1.33,-5.39,;1.33,-6.93,;2.67,-7.7,;4,-6.93,;5.33,-7.7,;4,-5.39,;2.67,-4.62,;2.67,-3.08,;1.33,-2.31,;,-3.08,;-1.33,-2.31,;-1.33,-.77,;;1.33,-.77,;2.67,,;4,-.77,;4,-2.31,;5.33,-3.08,;-2.67,,;-3.44,-1.33,;-1.9,1.33,;-4,.77,;-4,2.31,;-5.25,3.22,;-4.77,4.68,;-3.23,4.68,;-2.76,3.22,;2.67,-9.24,;4,-10.01,;4,-11.55,;5.33,-12.32,;2.67,-12.32,;1.33,-11.55,;,-12.32,;1.33,-10.01,)|
Show InChI InChI=1S/C26H19F2N3O5S/c1-15-9-23(24(35-2)14-21(15)17-10-18(27)13-19(28)11-17)31-22-5-4-20(12-16(22)3-6-26(31)32)37(33,34)30-25-7-8-36-29-25/h3-14H,1-2H3,(H,29,30)
US Patent
n/an/a 22n/an/an/an/an/an/a
Amgen Inc.
US Patent
Assay Description
HEK 293 cells stably transfected with human Nav1.7 were recorded in whole cell voltage clamp mode with the PatchXpress automated electrophysiology sy...
US Patent US9212182 (2015)
BindingDB Entry DOI: 10.7270/Q2TT4PTW
Cytochrome P450 2C9
(Homo sapiens (Human))
BDBM217431
(US9212182, 423 | US9212182, 424)
Show SMILES COc1cc(c(C)cc1-n1c2ccc(cc2ccc1=O)S(=O)(=O)Nc1ccon1)-c1cc(F)cc(F)c1 |(-1.33,-5.39,;,-4.62,;1.33,-5.39,;1.33,-6.93,;2.67,-7.7,;4,-6.93,;5.33,-7.7,;4,-5.39,;2.67,-4.62,;2.67,-3.08,;1.33,-2.31,;,-3.08,;-1.33,-2.31,;-1.33,-.77,;;1.33,-.77,;2.67,,;4,-.77,;4,-2.31,;5.33,-3.08,;-2.67,,;-3.44,-1.33,;-1.9,1.33,;-4,.77,;-4,2.31,;-5.25,3.22,;-4.77,4.68,;-3.23,4.68,;-2.76,3.22,;2.67,-9.24,;4,-10.01,;4,-11.55,;5.33,-12.32,;2.67,-12.32,;1.33,-11.55,;,-12.32,;1.33,-10.01,)|
Show InChI InChI=1S/C26H19F2N3O5S/c1-15-9-23(24(35-2)14-21(15)17-10-18(27)13-19(28)11-17)31-22-5-4-20(12-16(22)3-6-26(31)32)37(33,34)30-25-7-8-36-29-25/h3-14H,1-2H3,(H,29,30)
Reactome pathway
n/an/a 1.80E+4n/an/an/an/an/an/a
Amgen Inc.
Curated by ChEMBL
Assay Description
Inhibition of CYP2C9 in human liver microsomes using diclofenac as substrate in presence of NADPH
J Med Chem 60: 5990-6017 (2017)
Article DOI: 10.1021/acs.jmedchem.6b01850
BindingDB Entry DOI: 10.7270/Q2H1349F
Sodium channel protein type 9 subunit alpha
(Homo sapiens (Human))
BDBM217431
(US9212182, 423 | US9212182, 424)
Show SMILES COc1cc(c(C)cc1-n1c2ccc(cc2ccc1=O)S(=O)(=O)Nc1ccon1)-c1cc(F)cc(F)c1 |(-1.33,-5.39,;,-4.62,;1.33,-5.39,;1.33,-6.93,;2.67,-7.7,;4,-6.93,;5.33,-7.7,;4,-5.39,;2.67,-4.62,;2.67,-3.08,;1.33,-2.31,;,-3.08,;-1.33,-2.31,;-1.33,-.77,;;1.33,-.77,;2.67,,;4,-.77,;4,-2.31,;5.33,-3.08,;-2.67,,;-3.44,-1.33,;-1.9,1.33,;-4,.77,;-4,2.31,;-5.25,3.22,;-4.77,4.68,;-3.23,4.68,;-2.76,3.22,;2.67,-9.24,;4,-10.01,;4,-11.55,;5.33,-12.32,;2.67,-12.32,;1.33,-11.55,;,-12.32,;1.33,-10.01,)|
Show InChI InChI=1S/C26H19F2N3O5S/c1-15-9-23(24(35-2)14-21(15)17-10-18(27)13-19(28)11-17)31-22-5-4-20(12-16(22)3-6-26(31)32)37(33,34)30-25-7-8-36-29-25/h3-14H,1-2H3,(H,29,30)
n/an/a 22n/an/an/an/an/an/a
Amgen Inc.
Curated by ChEMBL
Assay Description
Ability to activate estrogen receptor 2-mediated transcription.
J Med Chem 60: 5990-6017 (2017)
Article DOI: 10.1021/acs.jmedchem.6b01850
BindingDB Entry DOI: 10.7270/Q2H1349F
Sodium channel protein type 9 subunit alpha
(Homo sapiens (Human))
BDBM217431
(US9212182, 423 | US9212182, 424)
Show SMILES COc1cc(c(C)cc1-n1c2ccc(cc2ccc1=O)S(=O)(=O)Nc1ccon1)-c1cc(F)cc(F)c1 |(-1.33,-5.39,;,-4.62,;1.33,-5.39,;1.33,-6.93,;2.67,-7.7,;4,-6.93,;5.33,-7.7,;4,-5.39,;2.67,-4.62,;2.67,-3.08,;1.33,-2.31,;,-3.08,;-1.33,-2.31,;-1.33,-.77,;;1.33,-.77,;2.67,,;4,-.77,;4,-2.31,;5.33,-3.08,;-2.67,,;-3.44,-1.33,;-1.9,1.33,;-4,.77,;-4,2.31,;-5.25,3.22,;-4.77,4.68,;-3.23,4.68,;-2.76,3.22,;2.67,-9.24,;4,-10.01,;4,-11.55,;5.33,-12.32,;2.67,-12.32,;1.33,-11.55,;,-12.32,;1.33,-10.01,)|
Show InChI InChI=1S/C26H19F2N3O5S/c1-15-9-23(24(35-2)14-21(15)17-10-18(27)13-19(28)11-17)31-22-5-4-20(12-16(22)3-6-26(31)32)37(33,34)30-25-7-8-36-29-25/h3-14H,1-2H3,(H,29,30)
US Patent
n/an/a 1.99E+3n/an/an/an/an/an/a
Amgen Inc.
US Patent
Assay Description
HEK 293 cells stably transfected with human Nav1.7 were recorded in whole cell voltage clamp mode with the PatchXpress automated electrophysiology sy...
US Patent US9212182 (2015)
BindingDB Entry DOI: 10.7270/Q2TT4PTW