BDBM217457 US9212182, 475::US9212182, 476
SMILES: COc1cc(c(F)cc1-n1c2ccc(cc2ccc1=O)S(=O)(=O)Nc1ccon1)-c1cccc(Cl)c1
InChI Key: InChIKey=VJTCEXLHCAFONE-UHFFFAOYSA-N
Data: 5 IC50
Activity Spreadsheet -- Enzyme Inhibition Constant Data from BindingDB
Found 5 hits for monomerid = 217457
Trg + Lig
Ki
nM
ΔG°
kcal/mole
IC50
nM
Kd
nM
EC50/IC50
nM
koff
s-1
kon
M-1s-1
pHTemp
°C
Sodium channel protein type 5 subunit alpha
(Homo sapiens (Human))
BDBM217457
(US9212182, 475 | US9212182, 476)
Show SMILES COc1cc(c(F)cc1-n1c2ccc(cc2ccc1=O)S(=O)(=O)Nc1ccon1)-c1cccc(Cl)c1 |(-1.33,-5.39,;,-4.62,;1.33,-5.39,;1.33,-6.93,;2.67,-7.7,;4,-6.93,;5.33,-7.7,;4,-5.39,;2.67,-4.62,;2.67,-3.08,;1.33,-2.31,;,-3.08,;-1.33,-2.31,;-1.33,-.77,;;1.33,-.77,;2.67,,;4,-.77,;4,-2.31,;5.33,-3.08,;-2.67,,;-3.44,-1.33,;-1.9,1.33,;-4,.77,;-4,2.31,;-5.25,3.22,;-4.77,4.68,;-3.23,4.68,;-2.76,3.22,;2.67,-9.24,;1.33,-10.01,;1.33,-11.55,;2.67,-12.32,;4,-11.55,;5.33,-12.32,;4,-10.01,)|
Show InChI InChI=1S/C25H17ClFN3O5S/c1-34-23-13-19(15-3-2-4-17(26)11-15)20(27)14-22(23)30-21-7-6-18(12-16(21)5-8-25(30)31)36(32,33)29-24-9-10-35-28-24/h2-14H,1H3,(H,28,29)
US Patent
n/an/a>3.00E+4n/an/an/an/an/an/a
Amgen Inc.
US Patent
Assay Description
293 cells stably transfected with Nav 1.5 were recorded in whole cell voltage clamp mode with the PatchXpress automated electrophysiology system acco...
US Patent US9212182 (2015)
BindingDB Entry DOI: 10.7270/Q2TT4PTW
Sodium channel protein type 9 subunit alpha
(Homo sapiens (Human))
BDBM217457
(US9212182, 475 | US9212182, 476)
Show SMILES COc1cc(c(F)cc1-n1c2ccc(cc2ccc1=O)S(=O)(=O)Nc1ccon1)-c1cccc(Cl)c1 |(-1.33,-5.39,;,-4.62,;1.33,-5.39,;1.33,-6.93,;2.67,-7.7,;4,-6.93,;5.33,-7.7,;4,-5.39,;2.67,-4.62,;2.67,-3.08,;1.33,-2.31,;,-3.08,;-1.33,-2.31,;-1.33,-.77,;;1.33,-.77,;2.67,,;4,-.77,;4,-2.31,;5.33,-3.08,;-2.67,,;-3.44,-1.33,;-1.9,1.33,;-4,.77,;-4,2.31,;-5.25,3.22,;-4.77,4.68,;-3.23,4.68,;-2.76,3.22,;2.67,-9.24,;1.33,-10.01,;1.33,-11.55,;2.67,-12.32,;4,-11.55,;5.33,-12.32,;4,-10.01,)|
Show InChI InChI=1S/C25H17ClFN3O5S/c1-34-23-13-19(15-3-2-4-17(26)11-15)20(27)14-22(23)30-21-7-6-18(12-16(21)5-8-25(30)31)36(32,33)29-24-9-10-35-28-24/h2-14H,1H3,(H,28,29)
US Patent
n/an/a 11n/an/an/an/an/an/a
Amgen Inc.
US Patent
Assay Description
HEK 293 cells stably transfected with human Nav1.7 were recorded in whole cell voltage clamp mode with the PatchXpress automated electrophysiology sy...
US Patent US9212182 (2015)
BindingDB Entry DOI: 10.7270/Q2TT4PTW
Sodium channel protein type 9 subunit alpha
(Homo sapiens (Human))
BDBM217457
(US9212182, 475 | US9212182, 476)
Show SMILES COc1cc(c(F)cc1-n1c2ccc(cc2ccc1=O)S(=O)(=O)Nc1ccon1)-c1cccc(Cl)c1 |(-1.33,-5.39,;,-4.62,;1.33,-5.39,;1.33,-6.93,;2.67,-7.7,;4,-6.93,;5.33,-7.7,;4,-5.39,;2.67,-4.62,;2.67,-3.08,;1.33,-2.31,;,-3.08,;-1.33,-2.31,;-1.33,-.77,;;1.33,-.77,;2.67,,;4,-.77,;4,-2.31,;5.33,-3.08,;-2.67,,;-3.44,-1.33,;-1.9,1.33,;-4,.77,;-4,2.31,;-5.25,3.22,;-4.77,4.68,;-3.23,4.68,;-2.76,3.22,;2.67,-9.24,;1.33,-10.01,;1.33,-11.55,;2.67,-12.32,;4,-11.55,;5.33,-12.32,;4,-10.01,)|
Show InChI InChI=1S/C25H17ClFN3O5S/c1-34-23-13-19(15-3-2-4-17(26)11-15)20(27)14-22(23)30-21-7-6-18(12-16(21)5-8-25(30)31)36(32,33)29-24-9-10-35-28-24/h2-14H,1H3,(H,28,29)
n/an/a 11n/an/an/an/an/an/a
Amgen Inc.
Curated by ChEMBL
Assay Description
Compound was tested for binding affinity towards Opioid receptor mu 1 by displacing [3H]DAGO radioligand in rat brain P2 synaptosomes membranes.
J Med Chem 60: 5990-6017 (2017)
Article DOI: 10.1021/acs.jmedchem.6b01850
BindingDB Entry DOI: 10.7270/Q2H1349F
Cytochrome P450 2C9
(Homo sapiens (Human))
BDBM217457
(US9212182, 475 | US9212182, 476)
Show SMILES COc1cc(c(F)cc1-n1c2ccc(cc2ccc1=O)S(=O)(=O)Nc1ccon1)-c1cccc(Cl)c1 |(-1.33,-5.39,;,-4.62,;1.33,-5.39,;1.33,-6.93,;2.67,-7.7,;4,-6.93,;5.33,-7.7,;4,-5.39,;2.67,-4.62,;2.67,-3.08,;1.33,-2.31,;,-3.08,;-1.33,-2.31,;-1.33,-.77,;;1.33,-.77,;2.67,,;4,-.77,;4,-2.31,;5.33,-3.08,;-2.67,,;-3.44,-1.33,;-1.9,1.33,;-4,.77,;-4,2.31,;-5.25,3.22,;-4.77,4.68,;-3.23,4.68,;-2.76,3.22,;2.67,-9.24,;1.33,-10.01,;1.33,-11.55,;2.67,-12.32,;4,-11.55,;5.33,-12.32,;4,-10.01,)|
Show InChI InChI=1S/C25H17ClFN3O5S/c1-34-23-13-19(15-3-2-4-17(26)11-15)20(27)14-22(23)30-21-7-6-18(12-16(21)5-8-25(30)31)36(32,33)29-24-9-10-35-28-24/h2-14H,1H3,(H,28,29)
Reactome pathway
n/an/a 2.60E+3n/an/an/an/an/an/a
Amgen Inc.
Curated by ChEMBL
Assay Description
Binding affinity towards estrogen receptor beta by [3H]17-beta-estradiol displacement.
J Med Chem 60: 5990-6017 (2017)
Article DOI: 10.1021/acs.jmedchem.6b01850
BindingDB Entry DOI: 10.7270/Q2H1349F
Sodium channel protein type 9 subunit alpha
(Homo sapiens (Human))
BDBM217457
(US9212182, 475 | US9212182, 476)
Show SMILES COc1cc(c(F)cc1-n1c2ccc(cc2ccc1=O)S(=O)(=O)Nc1ccon1)-c1cccc(Cl)c1 |(-1.33,-5.39,;,-4.62,;1.33,-5.39,;1.33,-6.93,;2.67,-7.7,;4,-6.93,;5.33,-7.7,;4,-5.39,;2.67,-4.62,;2.67,-3.08,;1.33,-2.31,;,-3.08,;-1.33,-2.31,;-1.33,-.77,;;1.33,-.77,;2.67,,;4,-.77,;4,-2.31,;5.33,-3.08,;-2.67,,;-3.44,-1.33,;-1.9,1.33,;-4,.77,;-4,2.31,;-5.25,3.22,;-4.77,4.68,;-3.23,4.68,;-2.76,3.22,;2.67,-9.24,;1.33,-10.01,;1.33,-11.55,;2.67,-12.32,;4,-11.55,;5.33,-12.32,;4,-10.01,)|
Show InChI InChI=1S/C25H17ClFN3O5S/c1-34-23-13-19(15-3-2-4-17(26)11-15)20(27)14-22(23)30-21-7-6-18(12-16(21)5-8-25(30)31)36(32,33)29-24-9-10-35-28-24/h2-14H,1H3,(H,28,29)
US Patent
n/an/a 2.29E+3n/an/an/an/an/an/a
Amgen Inc.
US Patent
Assay Description
HEK 293 cells stably transfected with human Nav1.7 were recorded in whole cell voltage clamp mode with the PatchXpress automated electrophysiology sy...
US Patent US9212182 (2015)
BindingDB Entry DOI: 10.7270/Q2TT4PTW