BDBM217818 US9212182, 684
SMILES: COc1cc(ccc1-n1c2ccc(cc2ccc1=O)S(=O)(=O)Nc1ccon1)-c1cc(F)cc(F)c1
InChI Key: InChIKey=ACQSFYKBTUBHFI-UHFFFAOYSA-N
Data: 3 IC50
Activity Spreadsheet -- Enzyme Inhibition Constant Data from BindingDB
Found 3 hits for monomerid = 217818
Trg + Lig
Ki
nM
ΔG°
kcal/mole
IC50
nM
Kd
nM
EC50/IC50
nM
koff
s-1
kon
M-1s-1
pHTemp
°C
Sodium channel protein type 9 subunit alpha
(Homo sapiens (Human))
BDBM217818
(US9212182, 684)
Show SMILES COc1cc(ccc1-n1c2ccc(cc2ccc1=O)S(=O)(=O)Nc1ccon1)-c1cc(F)cc(F)c1 |(6.67,-5.39,;5.33,-4.62,;4,-5.39,;4,-6.93,;2.67,-7.7,;1.33,-6.93,;1.33,-5.39,;2.67,-4.62,;2.67,-3.08,;1.33,-2.31,;,-3.08,;-1.33,-2.31,;-1.33,-.77,;;1.33,-.77,;2.67,,;4,-.77,;4,-2.31,;5.33,-3.08,;-2.67,,;-3.44,-1.33,;-1.9,1.33,;-4,.77,;-4,2.31,;-5.25,3.22,;-4.77,4.68,;-3.23,4.68,;-2.76,3.22,;2.67,-9.24,;4,-10.01,;4,-11.55,;5.33,-12.32,;2.67,-12.32,;1.33,-11.55,;,-12.32,;1.33,-10.01,)|
Show InChI InChI=1S/C25H17F2N3O5S/c1-34-23-13-15(17-10-18(26)14-19(27)11-17)2-5-22(23)30-21-6-4-20(12-16(21)3-7-25(30)31)36(32,33)29-24-8-9-35-28-24/h2-14H,1H3,(H,28,29)
US Patent
n/an/a 27n/an/an/an/an/an/a
Amgen Inc.
US Patent
Assay Description
HEK 293 cells stably transfected with human Nav1.7 were recorded in whole cell voltage clamp mode with the PatchXpress automated electrophysiology sy...
US Patent US9212182 (2015)
BindingDB Entry DOI: 10.7270/Q2TT4PTW
Cytochrome P450 2C9
(Homo sapiens (Human))
BDBM217818
(US9212182, 684)
Show SMILES COc1cc(ccc1-n1c2ccc(cc2ccc1=O)S(=O)(=O)Nc1ccon1)-c1cc(F)cc(F)c1 |(6.67,-5.39,;5.33,-4.62,;4,-5.39,;4,-6.93,;2.67,-7.7,;1.33,-6.93,;1.33,-5.39,;2.67,-4.62,;2.67,-3.08,;1.33,-2.31,;,-3.08,;-1.33,-2.31,;-1.33,-.77,;;1.33,-.77,;2.67,,;4,-.77,;4,-2.31,;5.33,-3.08,;-2.67,,;-3.44,-1.33,;-1.9,1.33,;-4,.77,;-4,2.31,;-5.25,3.22,;-4.77,4.68,;-3.23,4.68,;-2.76,3.22,;2.67,-9.24,;4,-10.01,;4,-11.55,;5.33,-12.32,;2.67,-12.32,;1.33,-11.55,;,-12.32,;1.33,-10.01,)|
Show InChI InChI=1S/C25H17F2N3O5S/c1-34-23-13-15(17-10-18(26)14-19(27)11-17)2-5-22(23)30-21-6-4-20(12-16(21)3-7-25(30)31)36(32,33)29-24-8-9-35-28-24/h2-14H,1H3,(H,28,29)
Reactome pathway
n/an/a 1.70E+4n/an/an/an/an/an/a
Amgen Inc.
Curated by ChEMBL
Assay Description
Inhibition of CYP2C9 in human liver microsomes using diclofenac as substrate in presence of NADPH
J Med Chem 60: 5990-6017 (2017)
Article DOI: 10.1021/acs.jmedchem.6b01850
BindingDB Entry DOI: 10.7270/Q2H1349F
Sodium channel protein type 9 subunit alpha
(Homo sapiens (Human))
BDBM217818
(US9212182, 684)
Show SMILES COc1cc(ccc1-n1c2ccc(cc2ccc1=O)S(=O)(=O)Nc1ccon1)-c1cc(F)cc(F)c1 |(6.67,-5.39,;5.33,-4.62,;4,-5.39,;4,-6.93,;2.67,-7.7,;1.33,-6.93,;1.33,-5.39,;2.67,-4.62,;2.67,-3.08,;1.33,-2.31,;,-3.08,;-1.33,-2.31,;-1.33,-.77,;;1.33,-.77,;2.67,,;4,-.77,;4,-2.31,;5.33,-3.08,;-2.67,,;-3.44,-1.33,;-1.9,1.33,;-4,.77,;-4,2.31,;-5.25,3.22,;-4.77,4.68,;-3.23,4.68,;-2.76,3.22,;2.67,-9.24,;4,-10.01,;4,-11.55,;5.33,-12.32,;2.67,-12.32,;1.33,-11.55,;,-12.32,;1.33,-10.01,)|
Show InChI InChI=1S/C25H17F2N3O5S/c1-34-23-13-15(17-10-18(26)14-19(27)11-17)2-5-22(23)30-21-6-4-20(12-16(21)3-7-25(30)31)36(32,33)29-24-8-9-35-28-24/h2-14H,1H3,(H,28,29)
n/an/a 27n/an/an/an/an/an/a
Amgen Inc.
Curated by ChEMBL
Assay Description
Inhibition of human Nav1.7 expressed in HEK293 cells at holding potential yielding 20 to 50% inactivation measured after 3 to 5 mins by patchXpress e...
J Med Chem 60: 5990-6017 (2017)
Article DOI: 10.1021/acs.jmedchem.6b01850
BindingDB Entry DOI: 10.7270/Q2H1349F