null
SMILES: CCc1csc(n1)-c1ccc(OCCCOc2ccc3[C@H](CC(O)=O)CCc3c2)cc1
InChI Key: InChIKey=SXGLOSJUBOLIOB-IBGZPJMESA-N
Activity Spreadsheet -- Enzyme Inhibition Constant Data from BindingDB
Found 6 hits for monomerid = 21789
Trg + Lig
Ki
nM
ΔG°
kcal/mole
IC50
nM
Kd
nM
EC50/IC50
nM
koff
s-1
kon
M-1s-1
pHTemp
°C
Peroxisome proliferator-activated receptor alpha
(Homo sapiens (Human))
BDBM21789
(2-[(1S)-5-{3-[4-(4-ethyl-1,3-thiazol-2-yl)phenoxy]...)
Show SMILES CCc1csc(n1)-c1ccc(OCCCOc2ccc3[C@H](CC(O)=O)CCc3c2)cc1 |r|
Show InChI InChI=1S/C25H27NO4S/c1-2-20-16-31-25(26-20)17-6-8-21(9-7-17)29-12-3-13-30-22-10-11-23-18(14-22)4-5-19(23)15-24(27)28/h6-11,14,16,19H,2-5,12-13,15H2,1H3,(H,27,28)/t19-/m0/s1
n/an/an/an/a 1.28E+3n/an/an/a25
Bayer HealthCare Pharmaceuticals Corporation
Assay Description
Activity was assessed by measuring the human PPAR ligand binding domain with the co-activator protein. Europium labeled anti-GST antibody, streptavid...
J Med Chem 50: 984-1000 (2007)
Article DOI: 10.1021/jm061299k
BindingDB Entry DOI: 10.7270/Q2NK3C93
Peroxisome proliferator-activated receptor delta
(Homo sapiens (Human))
BDBM21789
(2-[(1S)-5-{3-[4-(4-ethyl-1,3-thiazol-2-yl)phenoxy]...)
Show SMILES CCc1csc(n1)-c1ccc(OCCCOc2ccc3[C@H](CC(O)=O)CCc3c2)cc1 |r|
Show InChI InChI=1S/C25H27NO4S/c1-2-20-16-31-25(26-20)17-6-8-21(9-7-17)29-12-3-13-30-22-10-11-23-18(14-22)4-5-19(23)15-24(27)28/h6-11,14,16,19H,2-5,12-13,15H2,1H3,(H,27,28)/t19-/m0/s1
n/an/an/an/a 4.40n/an/an/a25
Bayer HealthCare Pharmaceuticals Corporation
Assay Description
Activity was assessed by measuring the human PPAR ligand binding domain with the co-activator protein. Europium labeled anti-GST antibody, streptavid...
J Med Chem 50: 984-1000 (2007)
Article DOI: 10.1021/jm061299k
BindingDB Entry DOI: 10.7270/Q2NK3C93
Peroxisome proliferator-activated receptor delta
(Homo sapiens (Human))
BDBM21789
(2-[(1S)-5-{3-[4-(4-ethyl-1,3-thiazol-2-yl)phenoxy]...)
Show SMILES CCc1csc(n1)-c1ccc(OCCCOc2ccc3[C@H](CC(O)=O)CCc3c2)cc1 |r|
Show InChI InChI=1S/C25H27NO4S/c1-2-20-16-31-25(26-20)17-6-8-21(9-7-17)29-12-3-13-30-22-10-11-23-18(14-22)4-5-19(23)15-24(27)28/h6-11,14,16,19H,2-5,12-13,15H2,1H3,(H,27,28)/t19-/m0/s1
n/an/an/an/a 2.27E+8n/an/an/an/a
TBA
Assay Description
Agonist activity at GST-tagged Homo sapiens (human) PPARdelta ligand binding domain after 2 hr by FRET assay
Citation and Details
Article DOI: 10.1007/s00044-011-9599-z
BindingDB Entry DOI: 10.7270/Q22J6FR8
Peroxisome proliferator-activated receptor alpha
(Homo sapiens (Human))
BDBM21789
(2-[(1S)-5-{3-[4-(4-ethyl-1,3-thiazol-2-yl)phenoxy]...)
Show SMILES CCc1csc(n1)-c1ccc(OCCCOc2ccc3[C@H](CC(O)=O)CCc3c2)cc1 |r|
Show InChI InChI=1S/C25H27NO4S/c1-2-20-16-31-25(26-20)17-6-8-21(9-7-17)29-12-3-13-30-22-10-11-23-18(14-22)4-5-19(23)15-24(27)28/h6-11,14,16,19H,2-5,12-13,15H2,1H3,(H,27,28)/t19-/m0/s1
n/an/an/an/a 7.81E+5n/an/an/an/a
TBA
Assay Description
Agonist activity at GST-tagged Homo sapiens (human) PPARalpha ligand binding domain after 2 hr by FRET assay
Citation and Details
Article DOI: 10.1007/s00044-011-9599-z
BindingDB Entry DOI: 10.7270/Q22J6FR8
Peroxisome proliferator-activated receptor gamma
(Homo sapiens (Human))
BDBM21789
(2-[(1S)-5-{3-[4-(4-ethyl-1,3-thiazol-2-yl)phenoxy]...)
Show SMILES CCc1csc(n1)-c1ccc(OCCCOc2ccc3[C@H](CC(O)=O)CCc3c2)cc1 |r|
Show InChI InChI=1S/C25H27NO4S/c1-2-20-16-31-25(26-20)17-6-8-21(9-7-17)29-12-3-13-30-22-10-11-23-18(14-22)4-5-19(23)15-24(27)28/h6-11,14,16,19H,2-5,12-13,15H2,1H3,(H,27,28)/t19-/m0/s1
NCI pathway
Reactome pathway
n/an/an/an/a 1.15E+6n/an/an/an/a
TBA
Assay Description
Agonist activity at Homo sapiens (human) PPARgamma expressed in mouse 3T3-L1 cells incubated for 2 days followed by compound wash out measured after ...
Citation and Details
Article DOI: 10.1007/s00044-011-9599-z
BindingDB Entry DOI: 10.7270/Q22J6FR8
Peroxisome proliferator-activated receptor gamma
(Homo sapiens (Human))
BDBM21789
(2-[(1S)-5-{3-[4-(4-ethyl-1,3-thiazol-2-yl)phenoxy]...)
Show SMILES CCc1csc(n1)-c1ccc(OCCCOc2ccc3[C@H](CC(O)=O)CCc3c2)cc1 |r|
Show InChI InChI=1S/C25H27NO4S/c1-2-20-16-31-25(26-20)17-6-8-21(9-7-17)29-12-3-13-30-22-10-11-23-18(14-22)4-5-19(23)15-24(27)28/h6-11,14,16,19H,2-5,12-13,15H2,1H3,(H,27,28)/t19-/m0/s1
NCI pathway
Reactome pathway
n/an/an/an/a 874n/an/an/a25
Bayer HealthCare Pharmaceuticals Corporation
Assay Description
PPAR gamma activity was assessed by using the IRBA in mouse 3T3-L1 cells. This assay measures the ability of test compound to cause an increase in th...
J Med Chem 50: 984-1000 (2007)
Article DOI: 10.1021/jm061299k
BindingDB Entry DOI: 10.7270/Q2NK3C93