null
SMILES: CC(C)C1CCC(CC1)N1CCC2(CC1)C(=O)NCc1cc(F)ccc21
InChI Key: InChIKey=CQBACSJGNXXJCS-UHFFFAOYSA-N
Activity Spreadsheet -- Enzyme Inhibition Constant Data from BindingDB
Found 4 hits for monomerid = 21858
Trg + Lig
Ki
nM
ΔG°
kcal/mole
IC50
nM
Kd
nM
EC50/IC50
nM
koff
s-1
kon
M-1s-1
pHTemp
°C
Nociceptin receptor
(Homo sapiens (Human))
BDBM21858
(7-fluoro-1'-[4-(propan-2-yl)cyclohexyl]-2,3-dihydr...)
Show SMILES CC(C)C1CCC(CC1)N1CCC2(CC1)C(=O)NCc1cc(F)ccc21 |(.21,-6.77,;-1.12,-6,;-2.46,-6.77,;-1.12,-4.46,;-2.46,-3.69,;-2.46,-2.15,;-1.12,-1.38,;.21,-2.15,;.21,-3.69,;-1.12,.16,;-2.46,.93,;-2.46,2.47,;-1.12,3.24,;.21,2.47,;.21,.93,;.21,4.01,;1.54,3.24,;.21,5.55,;-1.12,6.32,;-2.46,5.55,;-3.79,6.32,;-5.13,5.55,;-6.46,6.32,;-5.13,4.01,;-3.79,3.24,;-2.46,4.01,)|
Show InChI InChI=1S/C22H31FN2O/c1-15(2)16-3-6-19(7-4-16)25-11-9-22(10-12-25)20-8-5-18(23)13-17(20)14-24-21(22)26/h5,8,13,15-16,19H,3-4,6-7,9-12,14H2,1-2H3,(H,24,26)
Reactome pathway
23 -10.3n/an/an/an/an/a7.422
Istituto Superiore di Sanita
Assay Description
IC50 values were obtained by fitting the competition binding curves according to a 4-parameter logistic model. Inhibition constants Ki were derived f...
J Med Chem 51: 1058-62 (2008)
Article DOI: 10.1021/jm7009606
BindingDB Entry DOI: 10.7270/Q2HT2MMT
Kappa-type opioid receptor
(Homo sapiens (Human))
BDBM21858
(7-fluoro-1'-[4-(propan-2-yl)cyclohexyl]-2,3-dihydr...)
Show SMILES CC(C)C1CCC(CC1)N1CCC2(CC1)C(=O)NCc1cc(F)ccc21 |(.21,-6.77,;-1.12,-6,;-2.46,-6.77,;-1.12,-4.46,;-2.46,-3.69,;-2.46,-2.15,;-1.12,-1.38,;.21,-2.15,;.21,-3.69,;-1.12,.16,;-2.46,.93,;-2.46,2.47,;-1.12,3.24,;.21,2.47,;.21,.93,;.21,4.01,;1.54,3.24,;.21,5.55,;-1.12,6.32,;-2.46,5.55,;-3.79,6.32,;-5.13,5.55,;-6.46,6.32,;-5.13,4.01,;-3.79,3.24,;-2.46,4.01,)|
Show InChI InChI=1S/C22H31FN2O/c1-15(2)16-3-6-19(7-4-16)25-11-9-22(10-12-25)20-8-5-18(23)13-17(20)14-24-21(22)26/h5,8,13,15-16,19H,3-4,6-7,9-12,14H2,1-2H3,(H,24,26)
Reactome pathway
3.98E+3n/an/an/an/an/an/an/an/a
Istituto Superiore di Sanita
Assay Description
IC50 values were obtained by fitting the competition binding curves according to a 4-parameter logistic model. Inhibition constants Ki were derived f...
J Med Chem 51: 1058-62 (2008)
Article DOI: 10.1021/jm7009606
BindingDB Entry DOI: 10.7270/Q2HT2MMT
Mu-type opioid receptor
(Homo sapiens (Human))
BDBM21858
(7-fluoro-1'-[4-(propan-2-yl)cyclohexyl]-2,3-dihydr...)
Show SMILES CC(C)C1CCC(CC1)N1CCC2(CC1)C(=O)NCc1cc(F)ccc21 |(.21,-6.77,;-1.12,-6,;-2.46,-6.77,;-1.12,-4.46,;-2.46,-3.69,;-2.46,-2.15,;-1.12,-1.38,;.21,-2.15,;.21,-3.69,;-1.12,.16,;-2.46,.93,;-2.46,2.47,;-1.12,3.24,;.21,2.47,;.21,.93,;.21,4.01,;1.54,3.24,;.21,5.55,;-1.12,6.32,;-2.46,5.55,;-3.79,6.32,;-5.13,5.55,;-6.46,6.32,;-5.13,4.01,;-3.79,3.24,;-2.46,4.01,)|
Show InChI InChI=1S/C22H31FN2O/c1-15(2)16-3-6-19(7-4-16)25-11-9-22(10-12-25)20-8-5-18(23)13-17(20)14-24-21(22)26/h5,8,13,15-16,19H,3-4,6-7,9-12,14H2,1-2H3,(H,24,26)
NCI pathway
Reactome pathway
6.76E+3n/an/an/an/an/an/an/an/a
Istituto Superiore di Sanita
Assay Description
IC50 values were obtained by fitting the competition binding curves according to a 4-parameter logistic model. Inhibition constants Ki were derived f...
J Med Chem 51: 1058-62 (2008)
Article DOI: 10.1021/jm7009606
BindingDB Entry DOI: 10.7270/Q2HT2MMT
Delta-type opioid receptor
(Homo sapiens (Human))
BDBM21858
(7-fluoro-1'-[4-(propan-2-yl)cyclohexyl]-2,3-dihydr...)
Show SMILES CC(C)C1CCC(CC1)N1CCC2(CC1)C(=O)NCc1cc(F)ccc21 |(.21,-6.77,;-1.12,-6,;-2.46,-6.77,;-1.12,-4.46,;-2.46,-3.69,;-2.46,-2.15,;-1.12,-1.38,;.21,-2.15,;.21,-3.69,;-1.12,.16,;-2.46,.93,;-2.46,2.47,;-1.12,3.24,;.21,2.47,;.21,.93,;.21,4.01,;1.54,3.24,;.21,5.55,;-1.12,6.32,;-2.46,5.55,;-3.79,6.32,;-5.13,5.55,;-6.46,6.32,;-5.13,4.01,;-3.79,3.24,;-2.46,4.01,)|
Show InChI InChI=1S/C22H31FN2O/c1-15(2)16-3-6-19(7-4-16)25-11-9-22(10-12-25)20-8-5-18(23)13-17(20)14-24-21(22)26/h5,8,13,15-16,19H,3-4,6-7,9-12,14H2,1-2H3,(H,24,26)
Reactome pathway
>1.00E+4n/an/an/an/an/an/an/an/a
Istituto Superiore di Sanita
Assay Description
IC50 values were obtained by fitting the competition binding curves according to a 4-parameter logistic model. Inhibition constants Ki were derived f...
J Med Chem 51: 1058-62 (2008)
Article DOI: 10.1021/jm7009606
BindingDB Entry DOI: 10.7270/Q2HT2MMT