BDBM21862 N-benzyl-4-phenyl-1-[4-(propan-2-yl)cyclohexyl]piperidine-4-carboxamide::Piperidine Derivative, 4p
SMILES: CC(C)C1CCC(CC1)N1CCC(CC1)(C(=O)NCc1ccccc1)c1ccccc1
InChI Key: InChIKey=TZINXQGFSMEYPR-UHFFFAOYSA-N
Data: 4 KI
Activity Spreadsheet -- Enzyme Inhibition Constant Data from BindingDB
Found 4 hits for monomerid = 21862
Trg + Lig
Ki
nM
ΔG°
kcal/mole
IC50
nM
Kd
nM
EC50/IC50
nM
koff
s-1
kon
M-1s-1
pHTemp
°C
Nociceptin receptor
(Homo sapiens (Human))
BDBM21862
(N-benzyl-4-phenyl-1-[4-(propan-2-yl)cyclohexyl]pip...)
Show SMILES CC(C)C1CCC(CC1)N1CCC(CC1)(C(=O)NCc1ccccc1)c1ccccc1 |(.21,-6.77,;-1.12,-6,;-2.46,-6.77,;-1.12,-4.46,;-2.46,-3.69,;-2.46,-2.15,;-1.12,-1.38,;.21,-2.15,;.21,-3.69,;-1.12,.16,;-2.46,.93,;-2.46,2.47,;-1.12,3.24,;.21,2.47,;.21,.93,;.21,4.01,;1.54,3.24,;.21,5.55,;1.54,6.32,;1.54,7.86,;.21,8.63,;.21,10.17,;1.54,10.94,;2.88,10.17,;2.88,8.63,;-2.46,4.01,;-2.46,5.55,;-3.79,6.32,;-5.13,5.55,;-5.13,4.01,;-3.79,3.24,)|
Show InChI InChI=1S/C28H38N2O/c1-22(2)24-13-15-26(16-14-24)30-19-17-28(18-20-30,25-11-7-4-8-12-25)27(31)29-21-23-9-5-3-6-10-23/h3-12,22,24,26H,13-21H2,1-2H3,(H,29,31)
Reactome pathway
65 -9.70n/an/an/an/an/a7.422
Istituto Superiore di Sanita
Assay Description
IC50 values were obtained by fitting the competition binding curves according to a 4-parameter logistic model. Inhibition constants Ki were derived f...
J Med Chem 51: 1058-62 (2008)
Article DOI: 10.1021/jm7009606
BindingDB Entry DOI: 10.7270/Q2HT2MMT
Mu-type opioid receptor
(Homo sapiens (Human))
BDBM21862
(N-benzyl-4-phenyl-1-[4-(propan-2-yl)cyclohexyl]pip...)
Show SMILES CC(C)C1CCC(CC1)N1CCC(CC1)(C(=O)NCc1ccccc1)c1ccccc1 |(.21,-6.77,;-1.12,-6,;-2.46,-6.77,;-1.12,-4.46,;-2.46,-3.69,;-2.46,-2.15,;-1.12,-1.38,;.21,-2.15,;.21,-3.69,;-1.12,.16,;-2.46,.93,;-2.46,2.47,;-1.12,3.24,;.21,2.47,;.21,.93,;.21,4.01,;1.54,3.24,;.21,5.55,;1.54,6.32,;1.54,7.86,;.21,8.63,;.21,10.17,;1.54,10.94,;2.88,10.17,;2.88,8.63,;-2.46,4.01,;-2.46,5.55,;-3.79,6.32,;-5.13,5.55,;-5.13,4.01,;-3.79,3.24,)|
Show InChI InChI=1S/C28H38N2O/c1-22(2)24-13-15-26(16-14-24)30-19-17-28(18-20-30,25-11-7-4-8-12-25)27(31)29-21-23-9-5-3-6-10-23/h3-12,22,24,26H,13-21H2,1-2H3,(H,29,31)
NCI pathway
Reactome pathway
2.60E+3n/an/an/an/an/an/an/an/a
Istituto Superiore di Sanita
Assay Description
IC50 values were obtained by fitting the competition binding curves according to a 4-parameter logistic model. Inhibition constants Ki were derived f...
J Med Chem 51: 1058-62 (2008)
Article DOI: 10.1021/jm7009606
BindingDB Entry DOI: 10.7270/Q2HT2MMT
Kappa-type opioid receptor
(Homo sapiens (Human))
BDBM21862
(N-benzyl-4-phenyl-1-[4-(propan-2-yl)cyclohexyl]pip...)
Show SMILES CC(C)C1CCC(CC1)N1CCC(CC1)(C(=O)NCc1ccccc1)c1ccccc1 |(.21,-6.77,;-1.12,-6,;-2.46,-6.77,;-1.12,-4.46,;-2.46,-3.69,;-2.46,-2.15,;-1.12,-1.38,;.21,-2.15,;.21,-3.69,;-1.12,.16,;-2.46,.93,;-2.46,2.47,;-1.12,3.24,;.21,2.47,;.21,.93,;.21,4.01,;1.54,3.24,;.21,5.55,;1.54,6.32,;1.54,7.86,;.21,8.63,;.21,10.17,;1.54,10.94,;2.88,10.17,;2.88,8.63,;-2.46,4.01,;-2.46,5.55,;-3.79,6.32,;-5.13,5.55,;-5.13,4.01,;-3.79,3.24,)|
Show InChI InChI=1S/C28H38N2O/c1-22(2)24-13-15-26(16-14-24)30-19-17-28(18-20-30,25-11-7-4-8-12-25)27(31)29-21-23-9-5-3-6-10-23/h3-12,22,24,26H,13-21H2,1-2H3,(H,29,31)
Reactome pathway
>1.00E+4n/an/an/an/an/an/an/an/a
Istituto Superiore di Sanita
Assay Description
IC50 values were obtained by fitting the competition binding curves according to a 4-parameter logistic model. Inhibition constants Ki were derived f...
J Med Chem 51: 1058-62 (2008)
Article DOI: 10.1021/jm7009606
BindingDB Entry DOI: 10.7270/Q2HT2MMT
Delta-type opioid receptor
(Homo sapiens (Human))
BDBM21862
(N-benzyl-4-phenyl-1-[4-(propan-2-yl)cyclohexyl]pip...)
Show SMILES CC(C)C1CCC(CC1)N1CCC(CC1)(C(=O)NCc1ccccc1)c1ccccc1 |(.21,-6.77,;-1.12,-6,;-2.46,-6.77,;-1.12,-4.46,;-2.46,-3.69,;-2.46,-2.15,;-1.12,-1.38,;.21,-2.15,;.21,-3.69,;-1.12,.16,;-2.46,.93,;-2.46,2.47,;-1.12,3.24,;.21,2.47,;.21,.93,;.21,4.01,;1.54,3.24,;.21,5.55,;1.54,6.32,;1.54,7.86,;.21,8.63,;.21,10.17,;1.54,10.94,;2.88,10.17,;2.88,8.63,;-2.46,4.01,;-2.46,5.55,;-3.79,6.32,;-5.13,5.55,;-5.13,4.01,;-3.79,3.24,)|
Show InChI InChI=1S/C28H38N2O/c1-22(2)24-13-15-26(16-14-24)30-19-17-28(18-20-30,25-11-7-4-8-12-25)27(31)29-21-23-9-5-3-6-10-23/h3-12,22,24,26H,13-21H2,1-2H3,(H,29,31)
Reactome pathway
>1.00E+4n/an/an/an/an/an/an/an/a
Istituto Superiore di Sanita
Assay Description
IC50 values were obtained by fitting the competition binding curves according to a 4-parameter logistic model. Inhibition constants Ki were derived f...
J Med Chem 51: 1058-62 (2008)
Article DOI: 10.1021/jm7009606
BindingDB Entry DOI: 10.7270/Q2HT2MMT