null
SMILES: CN(C)c1ccc(cn1)-c1cc(NC2CC2)n2ncc(\C=C3/NC(=O)NC3=O)c2n1
InChI Key: InChIKey=UDMJTEJFYBAYJS-CHHVJCJISA-N
Activity Spreadsheet -- Enzyme Inhibition Constant Data from BindingDB
Found 4 hits for monomerid = 218936
Trg + Lig
Ki
nM
ΔG°
kcal/mole
IC50
nM
Kd
nM
EC50/IC50
nM
koff
s-1
kon
M-1s-1
pHTemp
°C
Casein kinase II subunit alpha/beta
(Homo sapiens (Human)-Rattus norvegicus)
BDBM218936
(US9303033, Q4, Table 13A, Compound 25 | US9303033,...)
Show SMILES CN(C)c1ccc(cn1)-c1cc(NC2CC2)n2ncc(\C=C3/NC(=O)NC3=O)c2n1
Show InChI InChI=1S/C20H20N8O2/c1-27(2)16-6-3-11(9-21-16)14-8-17(23-13-4-5-13)28-18(24-14)12(10-22-28)7-15-19(29)26-20(30)25-15/h3,6-10,13,23H,4-5H2,1-2H3,(H2,25,26,29,30)/b15-7-
US Patent
n/an/a<10n/an/an/an/a7.2n/a
SENHWA BIOSCIENCES, INC.
US Patent
Assay Description
In a final reaction volume of 50 μl, CK2 ααββ (4 ng, 8.5 mU) was incubated with various concentrations of test compounds in ...
US Patent US9303033 (2016)
BindingDB Entry DOI: 10.7270/Q2CN72RX
Casein kinase II subunit beta
(Homo sapiens (Human))
BDBM218936
(US9303033, Q4, Table 13A, Compound 25 | US9303033,...)
Show SMILES CN(C)c1ccc(cn1)-c1cc(NC2CC2)n2ncc(\C=C3/NC(=O)NC3=O)c2n1
Show InChI InChI=1S/C20H20N8O2/c1-27(2)16-6-3-11(9-21-16)14-8-17(23-13-4-5-13)28-18(24-14)12(10-22-28)7-15-19(29)26-20(30)25-15/h3,6-10,13,23H,4-5H2,1-2H3,(H2,25,26,29,30)/b15-7-
US Patent
n/an/a>2.50E+3n/an/an/an/a7.0n/a
SENHWA BIOSCIENCES, INC.
US Patent
Assay Description
5 uM ATP: Test compounds dissolved and diluted in DMSO (2 μl) were added to a reaction mixture comprising 10 μl of 5× Reaction Buffer (40 m...
US Patent US9303033 (2016)
BindingDB Entry DOI: 10.7270/Q2CN72RX
Casein kinase II subunit beta
(Homo sapiens (Human))
BDBM218936
(US9303033, Q4, Table 13A, Compound 25 | US9303033,...)
Show SMILES CN(C)c1ccc(cn1)-c1cc(NC2CC2)n2ncc(\C=C3/NC(=O)NC3=O)c2n1
Show InChI InChI=1S/C20H20N8O2/c1-27(2)16-6-3-11(9-21-16)14-8-17(23-13-4-5-13)28-18(24-14)12(10-22-28)7-15-19(29)26-20(30)25-15/h3,6-10,13,23H,4-5H2,1-2H3,(H2,25,26,29,30)/b15-7-
US Patent
n/an/a 256n/an/an/an/a7.0n/a
SENHWA BIOSCIENCES, INC.
US Patent
Assay Description
5 uM ATP: Test compounds dissolved and diluted in DMSO (2 μl) were added to a reaction mixture comprising 10 μl of 5× Reaction Buffer (40 m...
US Patent US9303033 (2016)
BindingDB Entry DOI: 10.7270/Q2CN72RX
Casein kinase II subunit alpha/beta
(Homo sapiens (Human)-Rattus norvegicus)
BDBM218936
(US9303033, Q4, Table 13A, Compound 25 | US9303033,...)
Show SMILES CN(C)c1ccc(cn1)-c1cc(NC2CC2)n2ncc(\C=C3/NC(=O)NC3=O)c2n1
Show InChI InChI=1S/C20H20N8O2/c1-27(2)16-6-3-11(9-21-16)14-8-17(23-13-4-5-13)28-18(24-14)12(10-22-28)7-15-19(29)26-20(30)25-15/h3,6-10,13,23H,4-5H2,1-2H3,(H2,25,26,29,30)/b15-7-
US Patent
n/an/a<10n/an/an/an/a7.2n/a
SENHWA BIOSCIENCES, INC.
US Patent
Assay Description
In a final reaction volume of 50 μl, CK2 ααββ (4 ng, 8.5 mU) was incubated with various concentrations of test compounds in ...
US Patent US9303033 (2016)
BindingDB Entry DOI: 10.7270/Q2CN72RX