null
SMILES: Clc1cccc(Nc2cc(NCc3cccnc3)n3ncc(\C=C4/NC(=O)NC4=O)c3n2)c1
InChI Key: InChIKey=ZAMGAZXHXFGZLU-IDUWFGFVSA-N
Activity Spreadsheet -- Enzyme Inhibition Constant Data from BindingDB
Found 2 hits for monomerid = 218981
Trg + Lig
Ki
nM
ΔG°
kcal/mole
IC50
nM
Kd
nM
EC50/IC50
nM
koff
s-1
kon
M-1s-1
pHTemp
°C
Casein kinase II subunit beta
(Homo sapiens (Human))
BDBM218981
(US9303033, I6, Table 19A, Compound 8)
Show SMILES Clc1cccc(Nc2cc(NCc3cccnc3)n3ncc(\C=C4/NC(=O)NC4=O)c3n2)c1
Show InChI InChI=1S/C22H17ClN8O2/c23-15-4-1-5-16(8-15)27-18-9-19(25-11-13-3-2-6-24-10-13)31-20(29-18)14(12-26-31)7-17-21(32)30-22(33)28-17/h1-10,12,25H,11H2,(H,27,29)(H2,28,30,32,33)/b17-7-
US Patent
n/an/a 704n/an/an/an/a7.0n/a
SENHWA BIOSCIENCES, INC.
US Patent
Assay Description
5 uM ATP: Test compounds dissolved and diluted in DMSO (2 μl) were added to a reaction mixture comprising 10 μl of 5× Reaction Buffer (40 m...
US Patent US9303033 (2016)
BindingDB Entry DOI: 10.7270/Q2CN72RX
Casein kinase II subunit alpha/beta
(Homo sapiens (Human)-Rattus norvegicus)
BDBM218981
(US9303033, I6, Table 19A, Compound 8)
Show SMILES Clc1cccc(Nc2cc(NCc3cccnc3)n3ncc(\C=C4/NC(=O)NC4=O)c3n2)c1
Show InChI InChI=1S/C22H17ClN8O2/c23-15-4-1-5-16(8-15)27-18-9-19(25-11-13-3-2-6-24-10-13)31-20(29-18)14(12-26-31)7-17-21(32)30-22(33)28-17/h1-10,12,25H,11H2,(H,27,29)(H2,28,30,32,33)/b17-7-
US Patent
n/an/a<1.00E+3n/an/an/an/a7.2n/a
SENHWA BIOSCIENCES, INC.
US Patent
Assay Description
In a final reaction volume of 50 μl, CK2 ααββ (4 ng, 8.5 mU) was incubated with various concentrations of test compounds in ...
US Patent US9303033 (2016)
BindingDB Entry DOI: 10.7270/Q2CN72RX