BDBM21901 4-[(3-chloro-4-fluorophenyl)amino]-8-hydroxy-6-[(1H-imidazol-4-ylmethyl)amino]quinoline-3-carbonitrile::Cyanoquinoline, 14
SMILES: Oc1cc(NCc2cnc[nH]2)cc2c(Nc3ccc(F)c(Cl)c3)c(cnc12)C#N
InChI Key: InChIKey=DAHZWEISUBICKV-UHFFFAOYSA-N
Data: 1 IC50
Activity Spreadsheet -- Enzyme Inhibition Constant Data from BindingDB
Found 1 hit for monomerid = 21901
Trg + Lig
Ki
nM
ΔG°
kcal/mole
IC50
nM
Kd
nM
EC50/IC50
nM
koff
s-1
kon
M-1s-1
pHTemp
°C
Mitogen-activated protein kinase kinase kinase 8
(Homo sapiens (Human))
BDBM21901
(4-[(3-chloro-4-fluorophenyl)amino]-8-hydroxy-6-[(1...)
Show SMILES Oc1cc(NCc2cnc[nH]2)cc2c(Nc3ccc(F)c(Cl)c3)c(cnc12)C#N
Show InChI InChI=1S/C20H14ClFN6O/c21-16-4-12(1-2-17(16)22)28-19-11(6-23)7-26-20-15(19)3-13(5-18(20)29)25-9-14-8-24-10-27-14/h1-5,7-8,10,25,29H,9H2,(H,24,27)(H,26,28)
NCI pathway
Reactome pathway
n/an/a 1.13E+4n/an/an/an/a7.230
Wyeth Research
Assay Description
Tpl2/Cot activity was directly assayed using GST-MEK1 as a substrate. The phosphorylation on serine residues was detected by an ELISA. IC50 calculati...
J Med Chem 50: 4728-45 (2007)
Article DOI: 10.1021/jm070436q
BindingDB Entry DOI: 10.7270/Q2891441