BDBM21905 4-[(3-chloro-4-fluorophenyl)amino]-3-cyano-6-[(1H-imidazol-4-ylmethyl)amino]-N,N-dimethylquinoline-8-carboxamide::Cyanoquinoline, 18
SMILES: CN(C)C(=O)c1cc(NCc2cnc[nH]2)cc2c(Nc3ccc(F)c(Cl)c3)c(cnc12)C#N
InChI Key: InChIKey=QCSDGVKAAVVIBF-UHFFFAOYSA-N
Data: 2 IC50
Activity Spreadsheet -- Enzyme Inhibition Constant Data from BindingDB
Found 2 hits for monomerid = 21905
Trg + Lig
Ki
nM
ΔG°
kcal/mole
IC50
nM
Kd
nM
EC50/IC50
nM
koff
s-1
kon
M-1s-1
pHTemp
°C
Epidermal growth factor receptor
(Homo sapiens (Human))
BDBM21905
(4-[(3-chloro-4-fluorophenyl)amino]-3-cyano-6-[(1H-...)
Show SMILES CN(C)C(=O)c1cc(NCc2cnc[nH]2)cc2c(Nc3ccc(F)c(Cl)c3)c(cnc12)C#N
Show InChI InChI=1S/C23H19ClFN7O/c1-32(2)23(33)18-6-15(28-11-16-10-27-12-30-16)5-17-21(13(8-26)9-29-22(17)18)31-14-3-4-20(25)19(24)7-14/h3-7,9-10,12,28H,11H2,1-2H3,(H,27,30)(H,29,31)
n/an/a>2.00E+4n/an/an/an/an/an/a
Wyeth Research
Assay Description
EGFR kinase activity was assayed using poly(Glu4-Tyr) as a substrate. The phosphorylation of tyrosine residue was detected by an ELISA. IC50 calculat...
J Med Chem 50: 4728-45 (2007)
Article DOI: 10.1021/jm070436q
BindingDB Entry DOI: 10.7270/Q2891441
Mitogen-activated protein kinase kinase kinase 8
(Homo sapiens (Human))
BDBM21905
(4-[(3-chloro-4-fluorophenyl)amino]-3-cyano-6-[(1H-...)
Show SMILES CN(C)C(=O)c1cc(NCc2cnc[nH]2)cc2c(Nc3ccc(F)c(Cl)c3)c(cnc12)C#N
Show InChI InChI=1S/C23H19ClFN7O/c1-32(2)23(33)18-6-15(28-11-16-10-27-12-30-16)5-17-21(13(8-26)9-29-22(17)18)31-14-3-4-20(25)19(24)7-14/h3-7,9-10,12,28H,11H2,1-2H3,(H,27,30)(H,29,31)
NCI pathway
Reactome pathway
n/an/a 130n/an/an/an/a7.230
Wyeth Research
Assay Description
Tpl2/Cot activity was directly assayed using GST-MEK1 as a substrate. The phosphorylation on serine residues was detected by an ELISA. IC50 calculati...
J Med Chem 50: 4728-45 (2007)
Article DOI: 10.1021/jm070436q
BindingDB Entry DOI: 10.7270/Q2891441