null
SMILES: O=C(NC1CC1)c1cc(cs1)-c1cc(NC2CC2)n2ncc(\C=C3/NC(=O)NC3=O)c2n1
InChI Key: InChIKey=ORQKZLDHHYFHTB-WCSRMQSCSA-N
Activity Spreadsheet -- Enzyme Inhibition Constant Data from BindingDB
Found 2 hits for monomerid = 219163
Trg + Lig
Ki
nM
ΔG°
kcal/mole
IC50
nM
Kd
nM
EC50/IC50
nM
koff
s-1
kon
M-1s-1
pHTemp
°C
Casein kinase II subunit alpha/beta
(Homo sapiens (Human)-Rattus norvegicus)
BDBM219163
(US9303033, J13, Table 24A, Compound 8)
Show SMILES O=C(NC1CC1)c1cc(cs1)-c1cc(NC2CC2)n2ncc(\C=C3/NC(=O)NC3=O)c2n1
Show InChI InChI=1S/C21H19N7O3S/c29-19-15(26-21(31)27-19)5-10-8-22-28-17(23-12-1-2-12)7-14(25-18(10)28)11-6-16(32-9-11)20(30)24-13-3-4-13/h5-9,12-13,23H,1-4H2,(H,24,30)(H2,26,27,29,31)/b15-5-
US Patent
n/an/a<10n/an/an/an/a7.2n/a
SENHWA BIOSCIENCES, INC.
US Patent
Assay Description
In a final reaction volume of 50 μl, CK2 ααββ (4 ng, 8.5 mU) was incubated with various concentrations of test compounds in ...
US Patent US9303033 (2016)
BindingDB Entry DOI: 10.7270/Q2CN72RX
Casein kinase II subunit beta
(Homo sapiens (Human))
BDBM219163
(US9303033, J13, Table 24A, Compound 8)
Show SMILES O=C(NC1CC1)c1cc(cs1)-c1cc(NC2CC2)n2ncc(\C=C3/NC(=O)NC3=O)c2n1
Show InChI InChI=1S/C21H19N7O3S/c29-19-15(26-21(31)27-19)5-10-8-22-28-17(23-12-1-2-12)7-14(25-18(10)28)11-6-16(32-9-11)20(30)24-13-3-4-13/h5-9,12-13,23H,1-4H2,(H,24,30)(H2,26,27,29,31)/b15-5-
US Patent
n/an/a 548n/an/an/an/a7.0n/a
SENHWA BIOSCIENCES, INC.
US Patent
Assay Description
5 uM ATP: Test compounds dissolved and diluted in DMSO (2 μl) were added to a reaction mixture comprising 10 μl of 5× Reaction Buffer (40 m...
US Patent US9303033 (2016)
BindingDB Entry DOI: 10.7270/Q2CN72RX