BDBM21920 2-[({8-chloro-4-[(3-chloro-4-fluorophenyl)amino]-3-cyanoquinolin-6-yl}amino)methyl]-1-oxidopyridin-1-ium::Cyanoquinoline, 33
SMILES: [O-][n+]1ccccc1CNc1cc(Cl)c2ncc(C#N)c(Nc3ccc(F)c(Cl)c3)c2c1
InChI Key: InChIKey=ORVPEVIDEJOHIY-UHFFFAOYSA-N
Data: 2 IC50
Activity Spreadsheet -- Enzyme Inhibition Constant Data from BindingDB
Found 2 hits for monomerid = 21920
Trg + Lig
Ki
nM
ΔG°
kcal/mole
IC50
nM
Kd
nM
EC50/IC50
nM
koff
s-1
kon
M-1s-1
pHTemp
°C
Epidermal growth factor receptor
(Homo sapiens (Human))
BDBM21920
(2-[({8-chloro-4-[(3-chloro-4-fluorophenyl)amino]-3...)
Show SMILES [O-][n+]1ccccc1CNc1cc(Cl)c2ncc(C#N)c(Nc3ccc(F)c(Cl)c3)c2c1
Show InChI InChI=1S/C22H14Cl2FN5O/c23-18-8-14(4-5-20(18)25)29-21-13(10-26)11-28-22-17(21)7-15(9-19(22)24)27-12-16-3-1-2-6-30(16)31/h1-9,11,27H,12H2,(H,28,29)
n/an/a 2.90E+3n/an/an/an/an/an/a
Wyeth Research
Assay Description
EGFR kinase activity was assayed using poly(Glu4-Tyr) as a substrate. The phosphorylation of tyrosine residue was detected by an ELISA. IC50 calculat...
J Med Chem 50: 4728-45 (2007)
Article DOI: 10.1021/jm070436q
BindingDB Entry DOI: 10.7270/Q2891441
Mitogen-activated protein kinase kinase kinase 8
(Homo sapiens (Human))
BDBM21920
(2-[({8-chloro-4-[(3-chloro-4-fluorophenyl)amino]-3...)
Show SMILES [O-][n+]1ccccc1CNc1cc(Cl)c2ncc(C#N)c(Nc3ccc(F)c(Cl)c3)c2c1
Show InChI InChI=1S/C22H14Cl2FN5O/c23-18-8-14(4-5-20(18)25)29-21-13(10-26)11-28-22-17(21)7-15(9-19(22)24)27-12-16-3-1-2-6-30(16)31/h1-9,11,27H,12H2,(H,28,29)
NCI pathway
Reactome pathway
n/an/a 18n/an/an/an/a7.230
Wyeth Research
Assay Description
Tpl2/Cot activity was directly assayed using GST-MEK1 as a substrate. The phosphorylation on serine residues was detected by an ELISA. IC50 calculati...
J Med Chem 50: 4728-45 (2007)
Article DOI: 10.1021/jm070436q
BindingDB Entry DOI: 10.7270/Q2891441