BDBM21929 8-chloro-4-[(3-chloro-4-fluorophenyl)amino]-6-{[(4-propyl-1H-imidazol-5-yl)methyl]amino}quinoline-3-carbonitrile::Cyanoquinoline, 40
SMILES: CCCc1nc[nH]c1CNc1cc(Cl)c2ncc(C#N)c(Nc3ccc(F)c(Cl)c3)c2c1
InChI Key: InChIKey=NGCNZPVYWSEEJK-UHFFFAOYSA-N
Data: 1 IC50
Activity Spreadsheet -- Enzyme Inhibition Constant Data from BindingDB
Found 1 hit for monomerid = 21929
Trg + Lig
Ki
nM
ΔG°
kcal/mole
IC50
nM
Kd
nM
EC50/IC50
nM
koff
s-1
kon
M-1s-1
pHTemp
°C
Mitogen-activated protein kinase kinase kinase 8
(Homo sapiens (Human))
BDBM21929
(8-chloro-4-[(3-chloro-4-fluorophenyl)amino]-6-{[(4...)
Show SMILES CCCc1nc[nH]c1CNc1cc(Cl)c2ncc(C#N)c(Nc3ccc(F)c(Cl)c3)c2c1
Show InChI InChI=1S/C23H19Cl2FN6/c1-2-3-20-21(31-12-30-20)11-28-15-6-16-22(32-14-4-5-19(26)17(24)7-14)13(9-27)10-29-23(16)18(25)8-15/h4-8,10,12,28H,2-3,11H2,1H3,(H,29,32)(H,30,31)
NCI pathway
Reactome pathway
n/an/a 25n/an/an/an/an/an/a
Wyeth Research
Assay Description
Tpl2/Cot activity was directly assayed using GST-MEK1 as a substrate. The phosphorylation on serine residues was detected by an ELISA. IC50 calculati...
J Med Chem 50: 4728-45 (2007)
Article DOI: 10.1021/jm070436q
BindingDB Entry DOI: 10.7270/Q2891441