BDBM22085 9-benzyl-6-{[(4-fluorophenyl)methyl]amino}-9H-purine-2-carbonitrile::Compound 3{9,17}
SMILES: Fc1ccc(CNc2nc(nc3n(Cc4ccccc4)cnc23)C#N)cc1
InChI Key: InChIKey=KWJDHYVDTMIHFW-UHFFFAOYSA-N
Data: 1 IC50
Activity Spreadsheet -- Enzyme Inhibition Constant Data from BindingDB
Found 1 hit for monomerid = 22085
Trg + Lig
Ki
nM
ΔG°
kcal/mole
IC50
nM
Kd
nM
EC50/IC50
nM
koff
s-1
kon
M-1s-1
pHTemp
°C
Cathepsin B-Like Cysteine Protease (TbcatB)
(Trypanosoma brucei)
BDBM22085
(9-benzyl-6-{[(4-fluorophenyl)methyl]amino}-9H-puri...)
Show SMILES Fc1ccc(CNc2nc(nc3n(Cc4ccccc4)cnc23)C#N)cc1
Show InChI InChI=1S/C20H15FN6/c21-16-8-6-14(7-9-16)11-23-19-18-20(26-17(10-22)25-19)27(13-24-18)12-15-4-2-1-3-5-15/h1-9,13H,11-12H2,(H,23,25,26)
n/an/a 3.30E+3n/an/an/an/an/a25
University of California at San Francisco
Assay Description
Enzyme activity was assayed in a 96-well plate format. TbcatB was incubated with inhibitor compound at room temperature for 20 min before the additio...
J Med Chem 51: 545-52 (2008)
Article DOI: 10.1021/jm070760l
BindingDB Entry DOI: 10.7270/Q2V40SH0