null
SMILES: NC\C(COc1ccc(cc1)S(N)(=O)=O)=C/F
InChI Key: InChIKey=GJRSZKOPZAJCGZ-VMPITWQZSA-N
Activity Spreadsheet -- Enzyme Inhibition Constant Data from BindingDB
Found 4 hits for monomerid = 220874
Trg + Lig
Ki
nM
ΔG°
kcal/mole
IC50
nM
Kd
nM
EC50/IC50
nM
koff
s-1
kon
M-1s-1
pHTemp
°C
Amine oxidase [flavin-containing] B
(Homo sapiens (Human))
BDBM220874
(US9302986, 11)
Show SMILES NC\C(COc1ccc(cc1)S(N)(=O)=O)=C/F
Show InChI InChI=1S/C10H13FN2O3S/c11-5-8(6-12)7-16-9-1-3-10(4-2-9)17(13,14)15/h1-5H,6-7,12H2,(H2,13,14,15)/b8-5+
US Patent
n/an/a>1.00E+4n/an/an/an/a7.437
BOEHRINGER INGELHEIM INTERNATIONAL GMBH
US Patent
Assay Description
Recombinant human MAO-B (0.06 mg/mL; Sigma Aldrich) was used as source of MAO-B enzyme activities. The assay was performed in a similar way as for hu...
US Patent US9302986 (2016)
BindingDB Entry DOI: 10.7270/Q2ZC81QZ
Amiloride-sensitive amine oxidase [copper-containing]
(Homo sapiens (Human))
BDBM220874
(US9302986, 11)
Show SMILES NC\C(COc1ccc(cc1)S(N)(=O)=O)=C/F
Show InChI InChI=1S/C10H13FN2O3S/c11-5-8(6-12)7-16-9-1-3-10(4-2-9)17(13,14)15/h1-5H,6-7,12H2,(H2,13,14,15)/b8-5+
US Patent
n/an/a>1.00E+4n/an/an/an/a7.437
BOEHRINGER INGELHEIM INTERNATIONAL GMBH
US Patent
Assay Description
Recombinant human DAO (2.4 μg/mL) was used as source of DAO enzyme activities. The assay was performed as described in the method for human SSAO/V...
US Patent US9302986 (2016)
BindingDB Entry DOI: 10.7270/Q2ZC81QZ
Membrane primary amine oxidase
(Rattus norvegicus (Rat))
BDBM220874
(US9302986, 11)
Show SMILES NC\C(COc1ccc(cc1)S(N)(=O)=O)=C/F
Show InChI InChI=1S/C10H13FN2O3S/c11-5-8(6-12)7-16-9-1-3-10(4-2-9)17(13,14)15/h1-5H,6-7,12H2,(H2,13,14,15)/b8-5+
US Patent
n/an/a<1.00E+5n/an/an/an/a7.4n/a
BOEHRINGER INGELHEIM INTERNATIONAL GMBH
US Patent
Assay Description
Abdominal fat from BALB/c mice, Wistar or Sprague Dawley rats, which are tissues enriched with SSAO/VAP-1-were surgically removed. For every gram of ...
US Patent US9302986 (2016)
BindingDB Entry DOI: 10.7270/Q2ZC81QZ
Membrane primary amine oxidase
(Homo sapiens (Human))
BDBM220874
(US9302986, 11)
Show SMILES NC\C(COc1ccc(cc1)S(N)(=O)=O)=C/F
Show InChI InChI=1S/C10H13FN2O3S/c11-5-8(6-12)7-16-9-1-3-10(4-2-9)17(13,14)15/h1-5H,6-7,12H2,(H2,13,14,15)/b8-5+
US Patent
n/an/a<1.00E+5n/an/an/an/a7.4n/a
BOEHRINGER INGELHEIM INTERNATIONAL GMBH
US Patent
Assay Description
Briefly, HMEC cell expressing human SSAO/VAP-1 were grown in several 10 cm petri dishes, once the cells reached 100% confluency, cells were harvested...
US Patent US9302986 (2016)
BindingDB Entry DOI: 10.7270/Q2ZC81QZ