null
SMILES: Cc1cc(OCC2(CCC2)C(O)=O)ncc1-c1ccc(-c2nc(c[nH]2)C(F)(F)F)c(F)c1
InChI Key: InChIKey=RFBNHWZHQVPKBN-UHFFFAOYSA-N
Activity Spreadsheet -- Enzyme Inhibition Constant Data from BindingDB
Found 1 hit for monomerid = 220983
Trg + Lig
Ki
nM
ΔG°
kcal/mole
IC50
nM
Kd
nM
EC50/IC50
nM
koff
s-1
kon
M-1s-1
pHTemp
°C
Diacylglycerol O-acyltransferase 1
(Homo sapiens (Human))
BDBM220983
(US9302996, 98-3)
Show SMILES Cc1cc(OCC2(CCC2)C(O)=O)ncc1-c1ccc(-c2nc(c[nH]2)C(F)(F)F)c(F)c1
Show InChI InChI=1S/C22H19F4N3O3/c1-12-7-18(32-11-21(20(30)31)5-2-6-21)27-9-15(12)13-3-4-14(16(23)8-13)19-28-10-17(29-19)22(24,25)26/h3-4,7-10H,2,5-6,11H2,1H3,(H,28,29)(H,30,31)
US Patent
n/an/a 0.75n/an/an/an/a7.430
MITSUBISHI TANABE PHARMA CORPORATION
US Patent
Assay Description
As a buffer to be used in the enzymatic reaction of DGAT1, 100 mM Tris-HCl (pH 7.4), 200 mM Sucrose, 20 mM MgCl2, 0.125% Bovine Serum Albumin (BSA) w...
US Patent US9302996 (2016)
BindingDB Entry DOI: 10.7270/Q2TM790N