BDBM221119 US9303012, 45
SMILES: C[C@@]12C[C@@H](CC(C)(C)C1)N(C2)C(=O)c1ccc(N2CC(F)(F)C2)c(OCC2CC2)n1
InChI Key: InChIKey=DMJFIKAISKBQHN-OPAMFIHVSA-N
Data: 2 EC50
Activity Spreadsheet -- Enzyme Inhibition Constant Data from BindingDB
Found 2 hits for monomerid = 221119
Trg + Lig
Ki
nM
ΔG°
kcal/mole
IC50
nM
Kd
nM
EC50/IC50
nM
koff
s-1
kon
M-1s-1
pHTemp
°C
Cannabinoid receptor 1
(Homo sapiens (Human))
BDBM221119
(US9303012, 45)
Show SMILES C[C@@]12C[C@@H](CC(C)(C)C1)N(C2)C(=O)c1ccc(N2CC(F)(F)C2)c(OCC2CC2)n1 |r,TLB:11:9:2:8.4.5|
Show InChI InChI=1S/C23H31F2N3O2/c1-21(2)8-16-9-22(3,11-21)12-28(16)20(29)17-6-7-18(27-13-23(24,25)14-27)19(26-17)30-10-15-4-5-15/h6-7,15-16H,4-5,8-14H2,1-3H3/t16-,22-/m1/s1
NCI pathway
Reactome pathway
US Patent
n/an/an/an/a>1.00E+4n/an/an/a37
HOFFMAN-LA ROCHE INC.
US Patent
Assay Description
CHO cells expressing human CB1 or CB2 receptors are seeded 17-24 hours prior to the experiment 50.000 cells per well in a black 96 well plate with fl...
US Patent US9303012 (2016)
BindingDB Entry DOI: 10.7270/Q2FF3R7H
Cannabinoid receptor 2
(Homo sapiens (Human))
BDBM221119
(US9303012, 45)
Show SMILES C[C@@]12C[C@@H](CC(C)(C)C1)N(C2)C(=O)c1ccc(N2CC(F)(F)C2)c(OCC2CC2)n1 |r,TLB:11:9:2:8.4.5|
Show InChI InChI=1S/C23H31F2N3O2/c1-21(2)8-16-9-22(3,11-21)12-28(16)20(29)17-6-7-18(27-13-23(24,25)14-27)19(26-17)30-10-15-4-5-15/h6-7,15-16H,4-5,8-14H2,1-3H3/t16-,22-/m1/s1
Reactome pathway
US Patent
n/an/an/an/a 6.80n/an/an/a37
HOFFMAN-LA ROCHE INC.
US Patent
Assay Description
CHO cells expressing human CB1 or CB2 receptors are seeded 17-24 hours prior to the experiment 50.000 cells per well in a black 96 well plate with fl...
US Patent US9303012 (2016)
BindingDB Entry DOI: 10.7270/Q2FF3R7H