BDBM221122 US9303012, 48
SMILES: CC1(C)COCN1C(=O)c1ccc(OC(F)(F)F)c(OCC2CC2)n1
InChI Key: InChIKey=WEBQDSSOWLKLLA-UHFFFAOYSA-N
Data: 2 EC50
Activity Spreadsheet -- Enzyme Inhibition Constant Data from BindingDB
Found 2 hits for monomerid = 221122
Trg + Lig
Ki
nM
ΔG°
kcal/mole
IC50
nM
Kd
nM
EC50/IC50
nM
koff
s-1
kon
M-1s-1
pHTemp
°C
Cannabinoid receptor 1
(Homo sapiens (Human))
BDBM221122
(US9303012, 48)
Show SMILES CC1(C)COCN1C(=O)c1ccc(OC(F)(F)F)c(OCC2CC2)n1
Show InChI InChI=1S/C16H19F3N2O4/c1-15(2)8-23-9-21(15)14(22)11-5-6-12(25-16(17,18)19)13(20-11)24-7-10-3-4-10/h5-6,10H,3-4,7-9H2,1-2H3
NCI pathway
Reactome pathway
US Patent
n/an/an/an/a>1.00E+4n/an/an/a37
HOFFMAN-LA ROCHE INC.
US Patent
Assay Description
CHO cells expressing human CB1 or CB2 receptors are seeded 17-24 hours prior to the experiment 50.000 cells per well in a black 96 well plate with fl...
US Patent US9303012 (2016)
BindingDB Entry DOI: 10.7270/Q2FF3R7H
Cannabinoid receptor 2
(Homo sapiens (Human))
BDBM221122
(US9303012, 48)
Show SMILES CC1(C)COCN1C(=O)c1ccc(OC(F)(F)F)c(OCC2CC2)n1
Show InChI InChI=1S/C16H19F3N2O4/c1-15(2)8-23-9-21(15)14(22)11-5-6-12(25-16(17,18)19)13(20-11)24-7-10-3-4-10/h5-6,10H,3-4,7-9H2,1-2H3
Reactome pathway
US Patent
n/an/an/an/a 108n/an/an/a37
HOFFMAN-LA ROCHE INC.
US Patent
Assay Description
CHO cells expressing human CB1 or CB2 receptors are seeded 17-24 hours prior to the experiment 50.000 cells per well in a black 96 well plate with fl...
US Patent US9303012 (2016)
BindingDB Entry DOI: 10.7270/Q2FF3R7H