BDBM221138 US9303012, 64
SMILES: CC1C(CCCN1C(=O)c1ccc(N2CC(F)(F)C2)c(OCC2CC2)n1)c1ccccc1
InChI Key: InChIKey=YLUVLAGMBQLRKW-UHFFFAOYSA-N
Data: 2 EC50
Activity Spreadsheet -- Enzyme Inhibition Constant Data from BindingDB
Found 2 hits for monomerid = 221138
Trg + Lig
Ki
nM
ΔG°
kcal/mole
IC50
nM
Kd
nM
EC50/IC50
nM
koff
s-1
kon
M-1s-1
pHTemp
°C
Cannabinoid receptor 1
(Homo sapiens (Human))
BDBM221138
(US9303012, 64)
Show SMILES CC1C(CCCN1C(=O)c1ccc(N2CC(F)(F)C2)c(OCC2CC2)n1)c1ccccc1
Show InChI InChI=1S/C25H29F2N3O2/c1-17-20(19-6-3-2-4-7-19)8-5-13-30(17)24(31)21-11-12-22(29-15-25(26,27)16-29)23(28-21)32-14-18-9-10-18/h2-4,6-7,11-12,17-18,20H,5,8-10,13-16H2,1H3
NCI pathway
Reactome pathway
US Patent
n/an/an/an/a>1.00E+4n/an/an/a37
HOFFMAN-LA ROCHE INC.
US Patent
Assay Description
CHO cells expressing human CB1 or CB2 receptors are seeded 17-24 hours prior to the experiment 50.000 cells per well in a black 96 well plate with fl...
US Patent US9303012 (2016)
BindingDB Entry DOI: 10.7270/Q2FF3R7H
Cannabinoid receptor 2
(Homo sapiens (Human))
BDBM221138
(US9303012, 64)
Show SMILES CC1C(CCCN1C(=O)c1ccc(N2CC(F)(F)C2)c(OCC2CC2)n1)c1ccccc1
Show InChI InChI=1S/C25H29F2N3O2/c1-17-20(19-6-3-2-4-7-19)8-5-13-30(17)24(31)21-11-12-22(29-15-25(26,27)16-29)23(28-21)32-14-18-9-10-18/h2-4,6-7,11-12,17-18,20H,5,8-10,13-16H2,1H3
Reactome pathway
US Patent
n/an/an/an/a 40.5n/an/an/a37
HOFFMAN-LA ROCHE INC.
US Patent
Assay Description
CHO cells expressing human CB1 or CB2 receptors are seeded 17-24 hours prior to the experiment 50.000 cells per well in a black 96 well plate with fl...
US Patent US9303012 (2016)
BindingDB Entry DOI: 10.7270/Q2FF3R7H