BDBM221146 US9303012, 72
SMILES: CC(C)(C)N(CCC(N)=O)C(=O)c1ccc(N2CC(F)(F)C2)c(OCC2CC2)n1
InChI Key: InChIKey=QUAJAGZEPNGQBL-UHFFFAOYSA-N
Data: 2 EC50
Activity Spreadsheet -- Enzyme Inhibition Constant Data from BindingDB
Found 2 hits for monomerid = 221146
Trg + Lig
Ki
nM
ΔG°
kcal/mole
IC50
nM
Kd
nM
EC50/IC50
nM
koff
s-1
kon
M-1s-1
pHTemp
°C
Cannabinoid receptor 1
(Homo sapiens (Human))
BDBM221146
(US9303012, 72)
Show SMILES CC(C)(C)N(CCC(N)=O)C(=O)c1ccc(N2CC(F)(F)C2)c(OCC2CC2)n1
Show InChI InChI=1S/C20H28F2N4O3/c1-19(2,3)26(9-8-16(23)27)18(28)14-6-7-15(25-11-20(21,22)12-25)17(24-14)29-10-13-4-5-13/h6-7,13H,4-5,8-12H2,1-3H3,(H2,23,27)
NCI pathway
Reactome pathway
US Patent
n/an/an/an/a>1.00E+4n/an/an/a37
HOFFMAN-LA ROCHE INC.
US Patent
Assay Description
CHO cells expressing human CB1 or CB2 receptors are seeded 17-24 hours prior to the experiment 50.000 cells per well in a black 96 well plate with fl...
US Patent US9303012 (2016)
BindingDB Entry DOI: 10.7270/Q2FF3R7H
Cannabinoid receptor 2
(Homo sapiens (Human))
BDBM221146
(US9303012, 72)
Show SMILES CC(C)(C)N(CCC(N)=O)C(=O)c1ccc(N2CC(F)(F)C2)c(OCC2CC2)n1
Show InChI InChI=1S/C20H28F2N4O3/c1-19(2,3)26(9-8-16(23)27)18(28)14-6-7-15(25-11-20(21,22)12-25)17(24-14)29-10-13-4-5-13/h6-7,13H,4-5,8-12H2,1-3H3,(H2,23,27)
Reactome pathway
US Patent
n/an/an/an/a 664n/an/an/a37
HOFFMAN-LA ROCHE INC.
US Patent
Assay Description
CHO cells expressing human CB1 or CB2 receptors are seeded 17-24 hours prior to the experiment 50.000 cells per well in a black 96 well plate with fl...
US Patent US9303012 (2016)
BindingDB Entry DOI: 10.7270/Q2FF3R7H