BDBM221152 US9303012, 78
SMILES: CC1(C)C[C@H](N(C1)C(=O)c1ccc(N2CC(F)(F)C2)c(OCC2CC2)n1)C(N)=O
InChI Key: InChIKey=GVEPGDZAQOFWPS-HNNXBMFYSA-N
Data: 2 EC50
Activity Spreadsheet -- Enzyme Inhibition Constant Data from BindingDB
Found 2 hits for monomerid = 221152
Trg + Lig
Ki
nM
ΔG°
kcal/mole
IC50
nM
Kd
nM
EC50/IC50
nM
koff
s-1
kon
M-1s-1
pHTemp
°C
Cannabinoid receptor 1
(Homo sapiens (Human))
BDBM221152
(US9303012, 78)
Show SMILES CC1(C)C[C@H](N(C1)C(=O)c1ccc(N2CC(F)(F)C2)c(OCC2CC2)n1)C(N)=O |r|
Show InChI InChI=1S/C20H26F2N4O3/c1-19(2)7-15(16(23)27)26(9-19)18(28)13-5-6-14(25-10-20(21,22)11-25)17(24-13)29-8-12-3-4-12/h5-6,12,15H,3-4,7-11H2,1-2H3,(H2,23,27)/t15-/m0/s1
NCI pathway
Reactome pathway
US Patent
n/an/an/an/a>1.00E+4n/an/an/a37
HOFFMAN-LA ROCHE INC.
US Patent
Assay Description
CHO cells expressing human CB1 or CB2 receptors are seeded 17-24 hours prior to the experiment 50.000 cells per well in a black 96 well plate with fl...
US Patent US9303012 (2016)
BindingDB Entry DOI: 10.7270/Q2FF3R7H
Cannabinoid receptor 2
(Homo sapiens (Human))
BDBM221152
(US9303012, 78)
Show SMILES CC1(C)C[C@H](N(C1)C(=O)c1ccc(N2CC(F)(F)C2)c(OCC2CC2)n1)C(N)=O |r|
Show InChI InChI=1S/C20H26F2N4O3/c1-19(2)7-15(16(23)27)26(9-19)18(28)13-5-6-14(25-10-20(21,22)11-25)17(24-13)29-8-12-3-4-12/h5-6,12,15H,3-4,7-11H2,1-2H3,(H2,23,27)/t15-/m0/s1
Reactome pathway
US Patent
n/an/an/an/a 1.20n/an/an/a37
HOFFMAN-LA ROCHE INC.
US Patent
Assay Description
CHO cells expressing human CB1 or CB2 receptors are seeded 17-24 hours prior to the experiment 50.000 cells per well in a black 96 well plate with fl...
US Patent US9303012 (2016)
BindingDB Entry DOI: 10.7270/Q2FF3R7H