BDBM221153 US9303012, 79
SMILES: NC(=O)[C@@H]1C[C@H](O)CN1C(=O)c1ccc(N2CC(F)(F)C2)c(OCC2CC2)n1
InChI Key: InChIKey=BNIHQVDQNDGOEY-FZMZJTMJSA-N
Data: 2 EC50
Activity Spreadsheet -- Enzyme Inhibition Constant Data from BindingDB
Found 2 hits for monomerid = 221153
Trg + Lig
Ki
nM
ΔG°
kcal/mole
IC50
nM
Kd
nM
EC50/IC50
nM
koff
s-1
kon
M-1s-1
pHTemp
°C
Cannabinoid receptor 1
(Homo sapiens (Human))
BDBM221153
(US9303012, 79)
Show SMILES NC(=O)[C@@H]1C[C@H](O)CN1C(=O)c1ccc(N2CC(F)(F)C2)c(OCC2CC2)n1 |r|
Show InChI InChI=1S/C18H22F2N4O4/c19-18(20)8-23(9-18)13-4-3-12(22-16(13)28-7-10-1-2-10)17(27)24-6-11(25)5-14(24)15(21)26/h3-4,10-11,14,25H,1-2,5-9H2,(H2,21,26)/t11-,14-/m0/s1
NCI pathway
Reactome pathway
US Patent
n/an/an/an/a>1.00E+4n/an/an/a37
HOFFMAN-LA ROCHE INC.
US Patent
Assay Description
CHO cells expressing human CB1 or CB2 receptors are seeded 17-24 hours prior to the experiment 50.000 cells per well in a black 96 well plate with fl...
US Patent US9303012 (2016)
BindingDB Entry DOI: 10.7270/Q2FF3R7H
Cannabinoid receptor 2
(Homo sapiens (Human))
BDBM221153
(US9303012, 79)
Show SMILES NC(=O)[C@@H]1C[C@H](O)CN1C(=O)c1ccc(N2CC(F)(F)C2)c(OCC2CC2)n1 |r|
Show InChI InChI=1S/C18H22F2N4O4/c19-18(20)8-23(9-18)13-4-3-12(22-16(13)28-7-10-1-2-10)17(27)24-6-11(25)5-14(24)15(21)26/h3-4,10-11,14,25H,1-2,5-9H2,(H2,21,26)/t11-,14-/m0/s1
Reactome pathway
US Patent
n/an/an/an/a 519n/an/an/a37
HOFFMAN-LA ROCHE INC.
US Patent
Assay Description
CHO cells expressing human CB1 or CB2 receptors are seeded 17-24 hours prior to the experiment 50.000 cells per well in a black 96 well plate with fl...
US Patent US9303012 (2016)
BindingDB Entry DOI: 10.7270/Q2FF3R7H