BDBM22120 aza-peptide Michael acceptor, 5d::benzyl N-[(1S)-1-{[(2S)-1-[(2E)-3-[N-(carbamoylmethyl)hydrazido]-N-phenylprop-2-enamide]-1-oxopropan-2-yl]carbamoyl}ethyl]carbamate
SMILES: C[C@H](NC(=O)OCc1ccccc1)C(=O)N[C@@H](C)C(=O)NN(CC(N)=O)C(=O)C=CC(=O)Nc1ccccc1
InChI Key: InChIKey=WDDFLNREQZNTFE-ROUUACIJSA-N
Data: 3 IC50
Activity Spreadsheet -- Enzyme Inhibition Constant Data from BindingDB
Found 3 hits for monomerid = 22120
Trg + Lig
Ki
nM
ΔG°
kcal/mole
IC50
nM
Kd
nM
EC50/IC50
nM
koff
s-1
kon
M-1s-1
pHTemp
°C
Asparaginyl Endopeptidase (AE)
(Schistosoma mansoni)
BDBM22120
(aza-peptide Michael acceptor, 5d | benzyl N-[(1S)-...)
Show SMILES C[C@H](NC(=O)OCc1ccccc1)C(=O)N[C@@H](C)C(=O)NN(CC(N)=O)C(=O)C=CC(=O)Nc1ccccc1 |r,w:28.28|
Show InChI InChI=1S/C26H30N6O7/c1-17(29-26(38)39-16-19-9-5-3-6-10-19)24(36)28-18(2)25(37)31-32(15-21(27)33)23(35)14-13-22(34)30-20-11-7-4-8-12-20/h3-14,17-18H,15-16H2,1-2H3,(H2,27,33)(H,28,36)(H,29,38)(H,30,34)(H,31,37)/t17-,18-/m0/s1
n/an/a 700n/an/an/an/a6.822
Georgia Institute of Technology
Assay Description
AE activity in the induction medium was measured with the substrate Cbz-Ala-Ala-Asn-AMC. In a black 96-well microtiter plate, aza-peptidyl inhibitors...
J Med Chem 51: 2816-32 (2008)
Article DOI: 10.1021/jm701311r
BindingDB Entry DOI: 10.7270/Q2KK9937
Asparaginyl Endopeptidase (AE)
(Ixodes ricinus)
BDBM22120
(aza-peptide Michael acceptor, 5d | benzyl N-[(1S)-...)
Show SMILES C[C@H](NC(=O)OCc1ccccc1)C(=O)N[C@@H](C)C(=O)NN(CC(N)=O)C(=O)C=CC(=O)Nc1ccccc1 |r,w:28.28|
Show InChI InChI=1S/C26H30N6O7/c1-17(29-26(38)39-16-19-9-5-3-6-10-19)24(36)28-18(2)25(37)31-32(15-21(27)33)23(35)14-13-22(34)30-20-11-7-4-8-12-20/h3-14,17-18H,15-16H2,1-2H3,(H2,27,33)(H,28,36)(H,29,38)(H,30,34)(H,31,37)/t17-,18-/m0/s1
n/an/a 10n/an/an/an/an/a25
Georgia Institute of Technology
Assay Description
AE activity in the induction medium was measured with the substrate Cbz-Ala-Ala-Asn-AMC. In a black 96-well microtiter plate, aza-peptidyl inhibitors...
J Med Chem 51: 2816-32 (2008)
Article DOI: 10.1021/jm701311r
BindingDB Entry DOI: 10.7270/Q2KK9937
Asparaginyl Endopeptidase (AE)
(Trichomonas vaginalis G3)
BDBM22120
(aza-peptide Michael acceptor, 5d | benzyl N-[(1S)-...)
Show SMILES C[C@H](NC(=O)OCc1ccccc1)C(=O)N[C@@H](C)C(=O)NN(CC(N)=O)C(=O)C=CC(=O)Nc1ccccc1 |r,w:28.28|
Show InChI InChI=1S/C26H30N6O7/c1-17(29-26(38)39-16-19-9-5-3-6-10-19)24(36)28-18(2)25(37)31-32(15-21(27)33)23(35)14-13-22(34)30-20-11-7-4-8-12-20/h3-14,17-18H,15-16H2,1-2H3,(H2,27,33)(H,28,36)(H,29,38)(H,30,34)(H,31,37)/t17-,18-/m0/s1
n/an/a 20n/an/an/an/a6.822
Georgia Institute of Technology
Assay Description
AE activity in the induction medium was measured with the substrate Cbz-Ala-Ala-Asn-AMC. In a black 96-well microtiter plate, aza-peptidyl inhibitors...
J Med Chem 51: 2816-32 (2008)
Article DOI: 10.1021/jm701311r
BindingDB Entry DOI: 10.7270/Q2KK9937