BDBM22130 aza-peptide Michael acceptor, 5n::benzyl N-[(1S)-1-{[(2S)-1-[(2E)-N-benzyl-3-[N-(carbamoylmethyl)hydrazido]-N-[(4-methoxyphenyl)methyl]prop-2-enamide]-1-oxopropan-2-yl]carbamoyl}ethyl]carbamate
SMILES: COc1ccc(CN(Cc2ccccc2)C(=O)C=CC(=O)N(CC(N)=O)NC(=O)[C@H](C)NC(=O)[C@H](C)NC(=O)OCc2ccccc2)cc1
InChI Key: InChIKey=WXQYPIFVHAYZGN-DQEYMECFSA-N
Data: 3 IC50
Activity Spreadsheet -- Enzyme Inhibition Constant Data from BindingDB
Found 3 hits for monomerid = 22130
Trg + Lig
Ki
nM
ΔG°
kcal/mole
IC50
nM
Kd
nM
EC50/IC50
nM
koff
s-1
kon
M-1s-1
pHTemp
°C
Asparaginyl Endopeptidase (AE)
(Schistosoma mansoni)
BDBM22130
(aza-peptide Michael acceptor, 5n | benzyl N-[(1S)-...)
Show SMILES COc1ccc(CN(Cc2ccccc2)C(=O)C=CC(=O)N(CC(N)=O)NC(=O)[C@H](C)NC(=O)[C@H](C)NC(=O)OCc2ccccc2)cc1 |r,w:18.19|
Show InChI InChI=1S/C35H40N6O8/c1-24(38-35(47)49-23-28-12-8-5-9-13-28)33(45)37-25(2)34(46)39-41(22-30(36)42)32(44)19-18-31(43)40(20-26-10-6-4-7-11-26)21-27-14-16-29(48-3)17-15-27/h4-19,24-25H,20-23H2,1-3H3,(H2,36,42)(H,37,45)(H,38,47)(H,39,46)/t24-,25-/m0/s1
n/an/a 90n/an/an/an/a6.822
Georgia Institute of Technology
Assay Description
AE activity in the induction medium was measured with the substrate Cbz-Ala-Ala-Asn-AMC. In a black 96-well microtiter plate, aza-peptidyl inhibitors...
J Med Chem 51: 2816-32 (2008)
Article DOI: 10.1021/jm701311r
BindingDB Entry DOI: 10.7270/Q2KK9937
Asparaginyl Endopeptidase (AE)
(Ixodes ricinus)
BDBM22130
(aza-peptide Michael acceptor, 5n | benzyl N-[(1S)-...)
Show SMILES COc1ccc(CN(Cc2ccccc2)C(=O)C=CC(=O)N(CC(N)=O)NC(=O)[C@H](C)NC(=O)[C@H](C)NC(=O)OCc2ccccc2)cc1 |r,w:18.19|
Show InChI InChI=1S/C35H40N6O8/c1-24(38-35(47)49-23-28-12-8-5-9-13-28)33(45)37-25(2)34(46)39-41(22-30(36)42)32(44)19-18-31(43)40(20-26-10-6-4-7-11-26)21-27-14-16-29(48-3)17-15-27/h4-19,24-25H,20-23H2,1-3H3,(H2,36,42)(H,37,45)(H,38,47)(H,39,46)/t24-,25-/m0/s1
n/an/a 12n/an/an/an/an/a25
Georgia Institute of Technology
Assay Description
AE activity in the induction medium was measured with the substrate Cbz-Ala-Ala-Asn-AMC. In a black 96-well microtiter plate, aza-peptidyl inhibitors...
J Med Chem 51: 2816-32 (2008)
Article DOI: 10.1021/jm701311r
BindingDB Entry DOI: 10.7270/Q2KK9937
Asparaginyl Endopeptidase (AE)
(Trichomonas vaginalis G3)
BDBM22130
(aza-peptide Michael acceptor, 5n | benzyl N-[(1S)-...)
Show SMILES COc1ccc(CN(Cc2ccccc2)C(=O)C=CC(=O)N(CC(N)=O)NC(=O)[C@H](C)NC(=O)[C@H](C)NC(=O)OCc2ccccc2)cc1 |r,w:18.19|
Show InChI InChI=1S/C35H40N6O8/c1-24(38-35(47)49-23-28-12-8-5-9-13-28)33(45)37-25(2)34(46)39-41(22-30(36)42)32(44)19-18-31(43)40(20-26-10-6-4-7-11-26)21-27-14-16-29(48-3)17-15-27/h4-19,24-25H,20-23H2,1-3H3,(H2,36,42)(H,37,45)(H,38,47)(H,39,46)/t24-,25-/m0/s1
n/an/a 2.30n/an/an/an/an/a25
Georgia Institute of Technology
Assay Description
AE activity in the induction medium was measured with the substrate Cbz-Ala-Ala-Asn-AMC. In a black 96-well microtiter plate, aza-peptidyl inhibitors...
J Med Chem 51: 2816-32 (2008)
Article DOI: 10.1021/jm701311r
BindingDB Entry DOI: 10.7270/Q2KK9937