BDBM22158 (3R,5S,6E)-7-[4-(4-fluorophenyl)-2-[methyl(1-methyl-1H-1,2,3,4-tetrazol-5-yl)amino]-6-(propan-2-yl)pyrimidin-5-yl]-3,5-dihydroxyhept-6-enoic acid::tetrazole compound, 13b
SMILES: CC(C)c1nc(nc(-c2ccc(F)cc2)c1\C=C\[C@@H](O)C[C@@H](O)CC(O)=O)N(C)c1nnnn1C
InChI Key: InChIKey=KOTLFRFIWUOROR-VEUZHWNKSA-N
Data: 1 IC50  1 EC50
Activity Spreadsheet -- Enzyme Inhibition Constant Data from BindingDB
Found 1 hit for monomerid = 22158
Trg + Lig
Ki
nM
ΔG°
kcal/mole
IC50
nM
Kd
nM
EC50/IC50
nM
koff
s-1
kon
M-1s-1
pHTemp
°C
HMG-CoA reductase
(Rattus norvegicus (rat))
BDBM22158
((3R,5S,6E)-7-[4-(4-fluorophenyl)-2-[methyl(1-methy...)
Show SMILES CC(C)c1nc(nc(-c2ccc(F)cc2)c1\C=C\[C@@H](O)C[C@@H](O)CC(O)=O)N(C)c1nnnn1C |r|
Show InChI InChI=1S/C23H28FN7O4/c1-13(2)20-18(10-9-16(32)11-17(33)12-19(34)35)21(14-5-7-15(24)8-6-14)26-22(25-20)30(3)23-27-28-29-31(23)4/h5-10,13,16-17,32-33H,11-12H2,1-4H3,(H,34,35)/b10-9+/t16-,17-/m1/s1
Reactome pathway
n/an/a 0.5n/a 1.40n/an/a7.037
Bristol-Myers Squibb Company
Assay Description
Enzyme Assay for HMG-CoA reductase was based on the conversion of isotopically labeled HMG-CoA to mevalonic acid using rat liver microsomes as enzyme...
J Med Chem 51: 2722-33 (2008)
Article DOI: 10.1021/jm800001n
BindingDB Entry DOI: 10.7270/Q2FT8JB2