BDBM22161 sodium (3R,5S,6E)-7-[4-(4-fluorophenyl)-2-[(1-methyl-1H-1,2,4-triazol-5-yl)amino]-6-(propan-2-yl)pyrimidin-5-yl]-3,5-dihydroxyhept-6-enoate::triazole compound, 1a
SMILES: CC(C)c1nc(Nc2ncnn2C)nc(-c2ccc(F)cc2)c1\C=C\[C@@H](O)C[C@@H](O)CC(O)=O
InChI Key: InChIKey=NZKSPBPEBDVMFK-PIIXRYACSA-N
Data: 1 IC50  1 EC50
Activity Spreadsheet -- Enzyme Inhibition Constant Data from BindingDB
Found 1 hit for monomerid = 22161
Trg + Lig
Ki
nM
ΔG°
kcal/mole
IC50
nM
Kd
nM
EC50/IC50
nM
koff
s-1
kon
M-1s-1
pHTemp
°C
HMG-CoA reductase
(Rattus norvegicus (rat))
BDBM22161
(sodium (3R,5S,6E)-7-[4-(4-fluorophenyl)-2-[(1-meth...)
Show SMILES CC(C)c1nc(Nc2ncnn2C)nc(-c2ccc(F)cc2)c1\C=C\[C@@H](O)C[C@@H](O)CC(O)=O |r|
Show InChI InChI=1S/C23H27FN6O4/c1-13(2)20-18(9-8-16(31)10-17(32)11-19(33)34)21(14-4-6-15(24)7-5-14)28-22(27-20)29-23-25-12-26-30(23)3/h4-9,12-13,16-17,31-32H,10-11H2,1-3H3,(H,33,34)(H,25,26,27,28,29)/b9-8+/t16-,17-/m1/s1
Reactome pathway
n/an/a 3n/a 3.70n/an/a7.037
Bristol-Myers Squibb Company
Assay Description
Enzyme Assay for HMG-CoA reductase was based on the conversion of isotopically labeled HMG-CoA to mevalonic acid using rat liver microsomes as enzyme...
J Med Chem 51: 2722-33 (2008)
Article DOI: 10.1021/jm800001n
BindingDB Entry DOI: 10.7270/Q2FT8JB2