BDBM221932 US9315492, 22
SMILES: CC(C)Oc1ccc(cc1C)-c1nnc(o1)-c1ccc2CCC(N)(CO)Cc2c1
InChI Key: InChIKey=STYOWZCUSFFFIJ-UHFFFAOYSA-N
Data: 1 IC50  1 EC50
Activity Spreadsheet -- Enzyme Inhibition Constant Data from BindingDB
Found 2 hits for monomerid = 221932
Trg + Lig
Ki
nM
ΔG°
kcal/mole
IC50
nM
Kd
nM
EC50/IC50
nM
koff
s-1
kon
M-1s-1
pHTemp
°C
Sphingosine 1-phosphate receptor 1 (S1P1)
(Mus musculus (Mouse))
BDBM221932
(US9315492, 22)
Show SMILES CC(C)Oc1ccc(cc1C)-c1nnc(o1)-c1ccc2CCC(N)(CO)Cc2c1
Show InChI InChI=1S/C23H27N3O3/c1-14(2)28-20-7-6-17(10-15(20)3)21-25-26-22(29-21)18-5-4-16-8-9-23(24,13-27)12-19(16)11-18/h4-7,10-11,14,27H,8-9,12-13,24H2,1-3H3
US Patent
n/an/an/an/a 8n/an/an/a25
Beijing Foreland Biopharma Co., Ltd.
US Patent
Assay Description
Assay procedures: OCC culture solution was preheated in water tank at 37° C. Cells were taken out from liquor nitrogen tank, left on the dry-ice, and...
US Patent US9315492 (2016)
BindingDB Entry DOI: 10.7270/Q2154FW6
Sphingosine 1-phosphate receptor 1
(Homo sapiens (Human))
BDBM221932
(US9315492, 22)
Show SMILES CC(C)Oc1ccc(cc1C)-c1nnc(o1)-c1ccc2CCC(N)(CO)Cc2c1
Show InChI InChI=1S/C23H27N3O3/c1-14(2)28-20-7-6-17(10-15(20)3)21-25-26-22(29-21)18-5-4-16-8-9-23(24,13-27)12-19(16)11-18/h4-7,10-11,14,27H,8-9,12-13,24H2,1-3H3
Reactome pathway
US Patent
n/an/a 3n/an/an/an/a7.4n/a
Beijing Foreland Biopharma Co., Ltd.
US Patent
Assay Description
Test method: wetting membranes by saponin solution, and preparing [35S]-GTPγS in binding solution (4×). The test compound was prepared as 4× of ...
US Patent US9315492 (2016)
BindingDB Entry DOI: 10.7270/Q2154FW6