null
SMILES: Fc1ccc(cc1)-c1nc2ccccc2c(=O)o1
InChI Key: InChIKey=FWPIOVHFUGZTPA-UHFFFAOYSA-N
Activity Spreadsheet -- Enzyme Inhibition Constant Data from BindingDB
Found 4 hits for monomerid = 222127
Trg + Lig
Ki
nM
ΔG°
kcal/mole
IC50
nM
Kd
nM
EC50/IC50
nM
koff
s-1
kon
M-1s-1
pHTemp
°C
Chymotrypsinogen A
(Bos taurus (bovine))
BDBM222127
(2-(4-Fluorophenyl)-4H-3,1-benzoxazin-4-one (16))
Show SMILES Fc1ccc(cc1)-c1nc2ccccc2c(=O)o1
Show InChI InChI=1S/C14H8FNO2/c15-10-7-5-9(6-8-10)13-16-12-4-2-1-3-11(12)14(17)18-13/h1-8H
Reactome pathway
9.41E+4n/an/an/an/an/an/an/an/a
University of Karachi
Assay Description
The change in optical density per minute (OD/min) was obtained by incorporating various concentrations of compounds over a range of substrate (SPpNA)...
Bioorg Chem 70: 210-221 (2017)
Article DOI: 10.1016/j.bioorg.2017.01.001
BindingDB Entry DOI: 10.7270/Q2QR4W00
Adenosine receptor A2a
(Rattus norvegicus (rat))
BDBM222127
(2-(4-Fluorophenyl)-4H-3,1-benzoxazin-4-one (16))
Show SMILES Fc1ccc(cc1)-c1nc2ccccc2c(=O)o1
Show InChI InChI=1S/C14H8FNO2/c15-10-7-5-9(6-8-10)13-16-12-4-2-1-3-11(12)14(17)18-13/h1-8H
Reactome pathway
>1.00E+5n/an/an/an/an/an/an/an/a
North-West University
Curated by ChEMBL
Assay Description
Displacement of [3H]NECA from Sprague-Dawley rat striatal membrane A2A adenosine receptor by scintillation counting analysis
Bioorg Med Chem Lett 30: (2020)
Adenosine receptor A1
(Rattus norvegicus (rat))
BDBM222127
(2-(4-Fluorophenyl)-4H-3,1-benzoxazin-4-one (16))
Show SMILES Fc1ccc(cc1)-c1nc2ccccc2c(=O)o1
Show InChI InChI=1S/C14H8FNO2/c15-10-7-5-9(6-8-10)13-16-12-4-2-1-3-11(12)14(17)18-13/h1-8H
Reactome pathway
>1.00E+5n/an/an/an/an/an/an/an/a
North-West University
Curated by ChEMBL
Assay Description
Displacement of [3H]DPCPX from Sprague-Dawley rat whole brain membrane A1AR by scintillation counting analysis
Bioorg Med Chem Lett 30: (2020)
Chymotrypsinogen A
(Bos taurus (bovine))
BDBM222127
(2-(4-Fluorophenyl)-4H-3,1-benzoxazin-4-one (16))
Show SMILES Fc1ccc(cc1)-c1nc2ccccc2c(=O)o1
Show InChI InChI=1S/C14H8FNO2/c15-10-7-5-9(6-8-10)13-16-12-4-2-1-3-11(12)14(17)18-13/h1-8H
Reactome pathway
n/an/a 1.59E+5n/an/an/an/a7.6n/a
University of Karachi
Assay Description
The α-chymotrypsin inhibition activity was evaluated in 50 mM Tris-HCl buffer pH 7.6 with 10 mM CaCl2. α-Chymotrypsin (bovine pancreas) at ...
Bioorg Chem 70: 210-221 (2017)
Article DOI: 10.1016/j.bioorg.2017.01.001
BindingDB Entry DOI: 10.7270/Q2QR4W00