BDBM22221 1,3,4-oxadiazole based compound, 5::2-[5-(4-tert-butylphenyl)-1,3,4-oxadiazol-2-yl]aniline
SMILES: CC(C)(C)c1ccc(cc1)-c1nnc(o1)-c1ccccc1N
InChI Key: InChIKey=ORSLEBNPFFMHND-UHFFFAOYSA-N
Data: 2 IC50
Activity Spreadsheet -- Enzyme Inhibition Constant Data from BindingDB
Found 2 hits for monomerid = 22221
Trg + Lig
Ki
nM
ΔG°
kcal/mole
IC50
nM
Kd
nM
EC50/IC50
nM
koff
s-1
kon
M-1s-1
pHTemp
°C
Sphingosine 1-phosphate receptor 3
(Homo sapiens (Human))
BDBM22221
(1,3,4-oxadiazole based compound, 5 | 2-[5-(4-tert-...)
Show SMILES CC(C)(C)c1ccc(cc1)-c1nnc(o1)-c1ccccc1N
Show InChI InChI=1S/C18H19N3O/c1-18(2,3)13-10-8-12(9-11-13)16-20-21-17(22-16)14-6-4-5-7-15(14)19/h4-11H,19H2,1-3H3
NCI pathway
Reactome pathway
n/an/a>5.00E+3n/an/an/an/an/a25
Merck Research Laboratories
Assay Description
The assay measures the displacement of [33P]-labeled sphingosine-1-phosphate (S1P) by test compounds from human S1P receptors expressed on CHO cell m...
J Med Chem 48: 6169-73 (2005)
Article DOI: 10.1021/jm0503244
BindingDB Entry DOI: 10.7270/Q26971W9
Sphingosine 1-phosphate receptor 1
(Homo sapiens (Human))
BDBM22221
(1,3,4-oxadiazole based compound, 5 | 2-[5-(4-tert-...)
Show SMILES CC(C)(C)c1ccc(cc1)-c1nnc(o1)-c1ccccc1N
Show InChI InChI=1S/C18H19N3O/c1-18(2,3)13-10-8-12(9-11-13)16-20-21-17(22-16)14-6-4-5-7-15(14)19/h4-11H,19H2,1-3H3
Reactome pathway
n/an/a 27n/an/an/an/an/a25
Merck Research Laboratories
Assay Description
The assay measures the displacement of [33P]-labeled sphingosine-1-phosphate (S1P) by test compounds from human S1P receptors expressed on CHO cell m...
J Med Chem 48: 6169-73 (2005)
Article DOI: 10.1021/jm0503244
BindingDB Entry DOI: 10.7270/Q26971W9