BDBM222734 US9315498, 22
SMILES: O=C1O[C@H]2CCC[C@H]2N1c1ccc(cn1)C#Cc1ccccc1
InChI Key: InChIKey=DCYVQLJHWVFJEL-SJORKVTESA-N
Data: 1 EC50
Activity Spreadsheet -- Enzyme Inhibition Constant Data from BindingDB
Found 1 hit for monomerid = 222734
Trg + Lig
Ki
nM
ΔG°
kcal/mole
IC50
nM
Kd
nM
EC50/IC50
nM
koff
s-1
kon
M-1s-1
pHTemp
°C
Metabotropic glutamate receptor 5a (mGluR5)
(Homo sapiens (Human))
BDBM222734
(US9315498, 22)
Show SMILES O=C1O[C@H]2CCC[C@H]2N1c1ccc(cn1)C#Cc1ccccc1 |r|
Show InChI InChI=1S/C19H16N2O2/c22-19-21(16-7-4-8-17(16)23-19)18-12-11-15(13-20-18)10-9-14-5-2-1-3-6-14/h1-3,5-6,11-13,16-17H,4,7-8H2/t16-,17+/m1/s1
US Patent
n/an/an/an/a 14n/an/an/a37
HOFFMAN-LA ROCHE INC.
US Patent
Assay Description
A monoclonal HEK-293 cell line stably transfected with a cDNA encoding for the human mGlu5a receptor was generated; for the work with mGlu5 Positive ...
US Patent US9315498 (2016)
BindingDB Entry DOI: 10.7270/Q23T9G2X