BDBM222741 US9315498, 29
SMILES: CC1(C)CN(C(=O)O1)c1ccc(cn1)C#Cc1cncc(F)c1
InChI Key: InChIKey=VILLJTFEJYBCOM-UHFFFAOYSA-N
Data: 1 EC50
Activity Spreadsheet -- Enzyme Inhibition Constant Data from BindingDB
Found 1 hit for monomerid = 222741
Trg + Lig
Ki
nM
ΔG°
kcal/mole
IC50
nM
Kd
nM
EC50/IC50
nM
koff
s-1
kon
M-1s-1
pHTemp
°C
Metabotropic glutamate receptor 5a (mGluR5)
(Homo sapiens (Human))
BDBM222741
(US9315498, 29)
Show SMILES CC1(C)CN(C(=O)O1)c1ccc(cn1)C#Cc1cncc(F)c1
Show InChI InChI=1S/C17H14FN3O2/c1-17(2)11-21(16(22)23-17)15-6-5-12(9-20-15)3-4-13-7-14(18)10-19-8-13/h5-10H,11H2,1-2H3
US Patent
n/an/an/an/a 15n/an/an/a37
HOFFMAN-LA ROCHE INC.
US Patent
Assay Description
A monoclonal HEK-293 cell line stably transfected with a cDNA encoding for the human mGlu5a receptor was generated; for the work with mGlu5 Positive ...
US Patent US9315498 (2016)
BindingDB Entry DOI: 10.7270/Q23T9G2X