BDBM222760 US9315498, 48
SMILES: CN1C(=O)N(CC1(C)C)c1ccc(cn1)C#Cc1cccnc1
InChI Key: InChIKey=YHBYGMGQXNUERN-UHFFFAOYSA-N
Data: 1 EC50
Activity Spreadsheet -- Enzyme Inhibition Constant Data from BindingDB
Found 1 hit for monomerid = 222760
Trg + Lig
Ki
nM
ΔG°
kcal/mole
IC50
nM
Kd
nM
EC50/IC50
nM
koff
s-1
kon
M-1s-1
pHTemp
°C
Metabotropic glutamate receptor 5a (mGluR5)
(Homo sapiens (Human))
BDBM222760
(US9315498, 48)
Show SMILES CN1C(=O)N(CC1(C)C)c1ccc(cn1)C#Cc1cccnc1
Show InChI InChI=1S/C18H18N4O/c1-18(2)13-22(17(23)21(18)3)16-9-8-15(12-20-16)7-6-14-5-4-10-19-11-14/h4-5,8-12H,13H2,1-3H3
US Patent
n/an/an/an/a 14n/an/an/a37
HOFFMAN-LA ROCHE INC.
US Patent
Assay Description
A monoclonal HEK-293 cell line stably transfected with a cDNA encoding for the human mGlu5a receptor was generated; for the work with mGlu5 Positive ...
US Patent US9315498 (2016)
BindingDB Entry DOI: 10.7270/Q23T9G2X