BDBM222797 US9315498, 87
SMILES: CC1(C)CCN(C(=O)C1)c1ccc(cn1)C#Cc1ccccc1
InChI Key: InChIKey=MYAADMBOZUZJPA-UHFFFAOYSA-N
Data: 1 EC50
Activity Spreadsheet -- Enzyme Inhibition Constant Data from BindingDB
Found 1 hit for monomerid = 222797
Trg + Lig
Ki
nM
ΔG°
kcal/mole
IC50
nM
Kd
nM
EC50/IC50
nM
koff
s-1
kon
M-1s-1
pHTemp
°C
Metabotropic glutamate receptor 5a (mGluR5)
(Homo sapiens (Human))
BDBM222797
(US9315498, 87)
Show SMILES CC1(C)CCN(C(=O)C1)c1ccc(cn1)C#Cc1ccccc1
Show InChI InChI=1S/C20H20N2O/c1-20(2)12-13-22(19(23)14-20)18-11-10-17(15-21-18)9-8-16-6-4-3-5-7-16/h3-7,10-11,15H,12-14H2,1-2H3
US Patent
n/an/an/an/a 12n/an/an/a37
HOFFMAN-LA ROCHE INC.
US Patent
Assay Description
A monoclonal HEK-293 cell line stably transfected with a cDNA encoding for the human mGlu5a receptor was generated; for the work with mGlu5 Positive ...
US Patent US9315498 (2016)
BindingDB Entry DOI: 10.7270/Q23T9G2X