BDBM222827 US9315498, 118
SMILES: CC1(C)CN(C(=O)C1)c1ncc(cn1)C#Cc1cccc(F)c1
InChI Key: InChIKey=IVFOBHCPKAEMSH-UHFFFAOYSA-N
Data: 1 EC50
Activity Spreadsheet -- Enzyme Inhibition Constant Data from BindingDB
Found 1 hit for monomerid = 222827
Trg + Lig
Ki
nM
ΔG°
kcal/mole
IC50
nM
Kd
nM
EC50/IC50
nM
koff
s-1
kon
M-1s-1
pHTemp
°C
Metabotropic glutamate receptor 5a (mGluR5)
(Homo sapiens (Human))
BDBM222827
(US9315498, 118)
Show SMILES CC1(C)CN(C(=O)C1)c1ncc(cn1)C#Cc1cccc(F)c1
Show InChI InChI=1S/C18H16FN3O/c1-18(2)9-16(23)22(12-18)17-20-10-14(11-21-17)7-6-13-4-3-5-15(19)8-13/h3-5,8,10-11H,9,12H2,1-2H3
US Patent
n/an/an/an/a 13n/an/an/a37
HOFFMAN-LA ROCHE INC.
US Patent
Assay Description
A monoclonal HEK-293 cell line stably transfected with a cDNA encoding for the human mGlu5a receptor was generated; for the work with mGlu5 Positive ...
US Patent US9315498 (2016)
BindingDB Entry DOI: 10.7270/Q23T9G2X