BDBM222905 US9315499, 4005
SMILES: CC1(C)CN(C1)C(=O)Cn1c2ncc(cc2cc(C(=O)NCc2ccc(Cl)cc2)c1=O)C(=O)NCc1cnccn1
InChI Key: InChIKey=IGFSQPPGGWHULZ-UHFFFAOYSA-N
Data: 1 IC50
Activity Spreadsheet -- Enzyme Inhibition Constant Data from BindingDB
Found 1 hit for monomerid = 222905
Trg + Lig
Ki
nM
ΔG°
kcal/mole
IC50
nM
Kd
nM
EC50/IC50
nM
koff
s-1
kon
M-1s-1
pHTemp
°C
DNA polymerase catalytic subunit
(Human cytomegalovirus (HCMV strain AD169) )
BDBM222905
(US9315499, 4005)
Show SMILES CC1(C)CN(C1)C(=O)Cn1c2ncc(cc2cc(C(=O)NCc2ccc(Cl)cc2)c1=O)C(=O)NCc1cnccn1
Show InChI InChI=1S/C29H28ClN7O4/c1-29(2)16-36(17-29)24(38)15-37-25-19(9-20(12-33-25)26(39)35-14-22-13-31-7-8-32-22)10-23(28(37)41)27(40)34-11-18-3-5-21(30)6-4-18/h3-10,12-13H,11,14-17H2,1-2H3,(H,34,40)(H,35,39)
US Patent
n/an/a 65n/an/an/an/a7.5n/a
Boehringer Ingelheim International GmbH
US Patent
Assay Description
The assay conditions are the following: 10 mM HEPES pH 7.5, 25 mM KCl, 7.5 mM NaCl, 5 mM MgCl2, 0.2 mg BSA/mL, 1 mM TCEP, 1.5% glycerol, 5% DMSO, 235...
US Patent US9315499 (2016)
BindingDB Entry DOI: 10.7270/Q2028QCZ