BDBM222924 US9315499, 6011
SMILES: COc1cc(N)nc2n(CC(=O)N(C)CC3(CO)COC3)c(=O)c(cc12)C(=O)NCc1ccc(Cl)cc1
InChI Key: InChIKey=MTAYIJKFIPCBHL-UHFFFAOYSA-N
Data: 1 IC50
Activity Spreadsheet -- Enzyme Inhibition Constant Data from BindingDB
Found 1 hit for monomerid = 222924
Trg + Lig
Ki
nM
ΔG°
kcal/mole
IC50
nM
Kd
nM
EC50/IC50
nM
koff
s-1
kon
M-1s-1
pHTemp
°C
DNA polymerase
(Human cytomegalovirus (HCMV strain AD169) )
BDBM222924
(US9315499, 6011)
Show SMILES COc1cc(N)nc2n(CC(=O)N(C)CC3(CO)COC3)c(=O)c(cc12)C(=O)NCc1ccc(Cl)cc1
Show InChI InChI=1S/C25H28ClN5O6/c1-30(11-25(12-32)13-37-14-25)21(33)10-31-22-17(19(36-2)8-20(27)29-22)7-18(24(31)35)23(34)28-9-15-3-5-16(26)6-4-15/h3-8,32H,9-14H2,1-2H3,(H2,27,29)(H,28,34)
US Patent
n/an/a 22n/an/an/an/a7.5n/a
Boehringer Ingelheim International GmbH
US Patent
Assay Description
The assay conditions are the following: 10 mM HEPES pH 7.5, 25 mM KCl, 7.5 mM NaCl, 5 mM MgCl2, 0.2 mg BSA/mL, 1 mM TCEP, 1.5% glycerol, 5% DMSO, 235...
US Patent US9315499 (2016)
BindingDB Entry DOI: 10.7270/Q2028QCZ