BDBM222926 US9315499, 6017
SMILES: Cn1cnc(c1)-c1cc2cc(C(=O)NCc3ccc(Cl)cc3)c(=O)n(CC(=O)N3CC(C)(F)C3)c2nc1N
InChI Key: InChIKey=VAWPSJAGFVFWFE-UHFFFAOYSA-N
Data: 1 IC50
Activity Spreadsheet -- Enzyme Inhibition Constant Data from BindingDB
Found 1 hit for monomerid = 222926
Trg + Lig
Ki
nM
ΔG°
kcal/mole
IC50
nM
Kd
nM
EC50/IC50
nM
koff
s-1
kon
M-1s-1
pHTemp
°C
DNA polymerase
(Human cytomegalovirus (HCMV strain AD169) )
BDBM222926
(US9315499, 6017)
Show SMILES Cn1cnc(c1)-c1cc2cc(C(=O)NCc3ccc(Cl)cc3)c(=O)n(CC(=O)N3CC(C)(F)C3)c2nc1N
Show InChI InChI=1S/C26H25ClFN7O3/c1-26(28)12-34(13-26)21(36)11-35-23-16(7-18(22(29)32-23)20-10-33(2)14-31-20)8-19(25(35)38)24(37)30-9-15-3-5-17(27)6-4-15/h3-8,10,14H,9,11-13H2,1-2H3,(H2,29,32)(H,30,37)
US Patent
n/an/a 77n/an/an/an/a7.5n/a
Boehringer Ingelheim International GmbH
US Patent
Assay Description
The assay conditions are the following: 10 mM HEPES pH 7.5, 25 mM KCl, 7.5 mM NaCl, 5 mM MgCl2, 0.2 mg BSA/mL, 1 mM TCEP, 1.5% glycerol, 5% DMSO, 235...
US Patent US9315499 (2016)
BindingDB Entry DOI: 10.7270/Q2028QCZ