BDBM22299 4-pentyl-N-{2-[2-(4-propanoylphenyl)-1H-indol-3-yl]ethyl}benzene-1-sulfonamide::tryptamine sulfonamide, 37i
SMILES: CCCCCc1ccc(cc1)S(=O)(=O)NCCc1c([nH]c2ccccc12)-c1ccc(cc1)C(=O)CC
InChI Key: InChIKey=DMZOJBDTAGOAIV-UHFFFAOYSA-N
Data: 1 IC50
Activity Spreadsheet -- Enzyme Inhibition Constant Data from BindingDB
Found 1 hit for monomerid = 22299
Trg + Lig
Ki
nM
ΔG°
kcal/mole
IC50
nM
Kd
nM
EC50/IC50
nM
koff
s-1
kon
M-1s-1
pHTemp
°C
Arachidonate 15-lipoxygenase
(Oryctolagus cuniculus (rabbit))
BDBM22299
(4-pentyl-N-{2-[2-(4-propanoylphenyl)-1H-indol-3-yl...)
Show SMILES CCCCCc1ccc(cc1)S(=O)(=O)NCCc1c([nH]c2ccccc12)-c1ccc(cc1)C(=O)CC
Show InChI InChI=1S/C30H34N2O3S/c1-3-5-6-9-22-12-18-25(19-13-22)36(34,35)31-21-20-27-26-10-7-8-11-28(26)32-30(27)24-16-14-23(15-17-24)29(33)4-2/h7-8,10-19,31-32H,3-6,9,20-21H2,1-2H3
n/an/a 11n/an/an/an/an/an/a
Bristol-Myers Squibb Company
Assay Description
The inhibitory activity of the compounds against purified 15-LO enzyme was determined using a standard colorimetric assay in which the lipid hydroper...
Bioorg Med Chem Lett 15: 1435-40 (2005)
Article DOI: 10.1016/j.bmcl.2004.12.081
BindingDB Entry DOI: 10.7270/Q2T43RD2