null
SMILES: CS(=O)CCOc1ccc2ncc(-c3cc4ccccc4o3)n2n1
InChI Key: InChIKey=IDDDYGQGNOINMS-UHFFFAOYSA-N
Activity Spreadsheet -- Enzyme Inhibition Constant Data from BindingDB
Found 1 hit for monomerid = 223027
Trg + Lig
Ki
nM
ΔG°
kcal/mole
IC50
nM
Kd
nM
EC50/IC50
nM
koff
s-1
kon
M-1s-1
pHTemp
°C
Isoform 2 of MAP kinase-interacting serine/threonine-protein kinase 1 (MNK1a) 344D]
(Homo sapiens (Human))
BDBM223027
(US9320737, II.4)
Show SMILES CS(=O)CCOc1ccc2ncc(-c3cc4ccccc4o3)n2n1 |w:1.0|
Show InChI InChI=1S/C17H15N3O3S/c1-24(21)9-8-22-17-7-6-16-18-11-13(20(16)19-17)15-10-12-4-2-3-5-14(12)23-15/h2-7,10-11H,8-9H2,1H3
US Patent
n/an/a 10n/an/an/an/a7.522
BAYER INTELLECTUAL PROPERTY GMBH
US Patent
Assay Description
For the assay 50 mL of a 100 fold concentrated solution of the test compound in DMSO was pipetted into a black low volume 384 well microtiter plate (...
US Patent US9320737 (2016)
BindingDB Entry DOI: 10.7270/Q22V2F00