null
SMILES: CS(=O)(=O)CCCOc1ccc2ncc(-c3cc4c(F)cccc4o3)n2n1
InChI Key: InChIKey=RAPOHHXIZMPZAI-UHFFFAOYSA-N
Activity Spreadsheet -- Enzyme Inhibition Constant Data from BindingDB
Found 1 hit for monomerid = 223036
Trg + Lig
Ki
nM
ΔG°
kcal/mole
IC50
nM
Kd
nM
EC50/IC50
nM
koff
s-1
kon
M-1s-1
pHTemp
°C
Isoform 2 of MAP kinase-interacting serine/threonine-protein kinase 1 (MNK1a) 344D]
(Homo sapiens (Human))
BDBM223036
(US9320737, III.9)
Show SMILES CS(=O)(=O)CCCOc1ccc2ncc(-c3cc4c(F)cccc4o3)n2n1
Show InChI InChI=1S/C18H16FN3O4S/c1-27(23,24)9-3-8-25-18-7-6-17-20-11-14(22(17)21-18)16-10-12-13(19)4-2-5-15(12)26-16/h2,4-7,10-11H,3,8-9H2,1H3
US Patent
n/an/a 17n/an/an/an/a7.522
BAYER INTELLECTUAL PROPERTY GMBH
US Patent
Assay Description
For the assay 50 mL of a 100 fold concentrated solution of the test compound in DMSO was pipetted into a black low volume 384 well microtiter plate (...
US Patent US9320737 (2016)
BindingDB Entry DOI: 10.7270/Q22V2F00