BDBM223046 6-{[(1r)-1- cyclobutylethyl]amino}- 7-[(trans-4- methylcyclohexyl) methyl]-8-[(3r)-3- phenylmorpholin-4- yl]-7h-purine-2- carboxylic acid::US9540377, 11.10
SMILES: C[C@@H](Nc1nc(nc2nc(N3CCOC[C@H]3c3ccccc3)n(C[C@H]3CC[C@H](C)CC3)c12)C(O)=O)C1CCC1
InChI Key: InChIKey=XGVJFXYBZSOQBA-CTVDGRRTSA-N
Data: 1 IC50
Activity Spreadsheet -- Enzyme Inhibition Constant Data from BindingDB
Found 1 hit for monomerid = 223046
Trg + Lig
Ki
nM
ΔG°
kcal/mole
IC50
nM
Kd
nM
EC50/IC50
nM
koff
s-1
kon
M-1s-1
pHTemp
°C
p53-binding protein Mdm2
(Homo sapiens (Human))
BDBM223046
(6-{[(1r)-1- cyclobutylethyl]amino}- 7-[(trans-4- m...)
Show SMILES C[C@@H](Nc1nc(nc2nc(N3CCOC[C@H]3c3ccccc3)n(C[C@H]3CC[C@H](C)CC3)c12)C(O)=O)C1CCC1 |r,wU:1.0,27.29,wD:24.25,15.16,(-5.24,-1.96,;-3.91,-2.73,;-2.57,-1.96,;-2.57,-.42,;-3.91,.35,;-3.91,1.89,;-2.57,2.66,;-1.24,1.89,;.23,2.36,;1.13,1.12,;2.67,1.12,;3.44,-.22,;4.98,-.22,;5.75,1.12,;4.98,2.45,;3.44,2.45,;2.67,3.78,;3.44,5.12,;2.67,6.45,;1.13,6.45,;.36,5.12,;1.13,3.78,;.23,-.13,;.62,-1.62,;2.11,-2.02,;2.51,-3.5,;4,-3.9,;5.09,-2.81,;6.57,-3.21,;4.69,-1.32,;3.2,-.93,;-1.24,.35,;-5.24,2.66,;-6.57,1.89,;-5.24,4.2,;-3.91,-4.27,;-5,-5.36,;-3.91,-6.45,;-2.82,-5.36,)|
Show InChI InChI=1S/C30H40N6O3/c1-19-11-13-21(14-12-19)17-36-25-26(31-20(2)22-9-6-10-22)32-28(29(37)38)33-27(25)34-30(36)35-15-16-39-18-24(35)23-7-4-3-5-8-23/h3-5,7-8,19-22,24H,6,9-18H2,1-2H3,(H,37,38)(H,31,32,33)/t19-,20-,21-,24+/m1/s1
US Patent
n/an/a 0.202n/an/an/an/an/a25
Merck Sharp & Dohme Corp.
US Patent
Assay Description
An HDM2 FRET assay was developed to assess the compounds' inhibitory activity towards binding of p53 protein. A truncated version of HDM2 with re...
US Patent US9540377 (2017)
BindingDB Entry DOI: 10.7270/Q2RF5X1F