BDBM223135 2-((5-(4-chlorophenyl)pyridin-3-yl)methylene)hydrazinecarboxamide (9f)
SMILES: NC(=O)N\N=C\c1cncc(c1)-c1ccc(Cl)cc1
InChI Key: InChIKey=KLBZYHZMPUKFBE-REZTVBANSA-N
Data: 1 IC50
Activity Spreadsheet -- Enzyme Inhibition Constant Data from BindingDB
Found 1 hit for monomerid = 223135
Trg + Lig
Ki
nM
ΔG°
kcal/mole
IC50
nM
Kd
nM
EC50/IC50
nM
koff
s-1
kon
M-1s-1
pHTemp
°C
Protein arginine N-methyltransferase 5
(Homo sapiens (Human))
BDBM223135
(2-((5-(4-chlorophenyl)pyridin-3-yl)methylene)hydra...)
Show SMILES NC(=O)N\N=C\c1cncc(c1)-c1ccc(Cl)cc1
Show InChI InChI=1S/C13H11ClN4O/c14-12-3-1-10(2-4-12)11-5-9(6-16-8-11)7-17-18-13(15)19/h1-8H,(H3,15,18,19)/b17-7+
n/an/a 6.90E+3n/an/an/an/an/a25
Sichuan University
Assay Description
All in vitro enzymatic assays were carried out by Shanghai ChemPartner Co. (998 Halei Road, Pudong New Area, Shanghai, 201203, China). To measure the...
Chem Biol Drug Des 89: 585-598 (2017)
Article DOI: 10.1111/cbdd.12881
BindingDB Entry DOI: 10.7270/Q21V5CTR