BDBM223463 US9320722, CD12
SMILES: OC(NC(=O)c1ccncc1)C(=O)c1cccs1
InChI Key: InChIKey=UBCUJTVVSOHNLX-UHFFFAOYSA-N
Data: 3 IC50
Activity Spreadsheet -- Enzyme Inhibition Constant Data from BindingDB
Found 3 hits for monomerid = 223463
Trg + Lig
Ki
nM
ΔG°
kcal/mole
IC50
nM
Kd
nM
EC50/IC50
nM
koff
s-1
kon
M-1s-1
pHTemp
°C
Aldehyde dehydrogenase 1A1 (ALDH1A1)
(Homo sapiens (Human))
BDBM223463
(US9320722, CD12)
Show SMILES OC(NC(=O)c1ccncc1)C(=O)c1cccs1
Show InChI InChI=1S/C12H10N2O3S/c15-10(9-2-1-7-18-9)12(17)14-11(16)8-3-5-13-6-4-8/h1-7,12,17H,(H,14,16)
Reactome pathway
US Patent
n/an/a 4.20E+3n/an/an/an/a7.5n/a
Indiana University Research and Technology Corporation
US Patent
Assay Description
IC50 values were determined for CB29 and its analogs using propionaldehyde as the substrate for ALDH1A1 and ALDH2 or benzaldehyde as the substrate fo...
US Patent US9320722 (2016)
BindingDB Entry DOI: 10.7270/Q2V69HGB
Aldehyde dehydrogenase 3A1 (ALDH3A1)
(Homo sapiens (Human))
BDBM223463
(US9320722, CD12)
Show SMILES OC(NC(=O)c1ccncc1)C(=O)c1cccs1
Show InChI InChI=1S/C12H10N2O3S/c15-10(9-2-1-7-18-9)12(17)14-11(16)8-3-5-13-6-4-8/h1-7,12,17H,(H,14,16)
US Patent
n/an/a 5.60E+3n/an/an/an/a7.5n/a
Indiana University Research and Technology Corporation
US Patent
Assay Description
IC50 values were determined for CB29 and its analogs using propionaldehyde as the substrate for ALDH1A1 and ALDH2 or benzaldehyde as the substrate fo...
US Patent US9320722 (2016)
BindingDB Entry DOI: 10.7270/Q2V69HGB
Aldehyde dehydrogenase, mitochondrial
(Homo sapiens (Human))
BDBM223463
(US9320722, CD12)
Show SMILES OC(NC(=O)c1ccncc1)C(=O)c1cccs1
Show InChI InChI=1S/C12H10N2O3S/c15-10(9-2-1-7-18-9)12(17)14-11(16)8-3-5-13-6-4-8/h1-7,12,17H,(H,14,16)
Reactome pathway
US Patent
n/an/a 5.30E+3n/an/an/an/a7.5n/a
Indiana University Research and Technology Corporation
US Patent
Assay Description
IC50 values were determined for CB29 and its analogs using propionaldehyde as the substrate for ALDH1A1 and ALDH2 or benzaldehyde as the substrate fo...
US Patent US9320722 (2016)
BindingDB Entry DOI: 10.7270/Q2V69HGB