BDBM2238 2-Pyridinone derivative 18::3-[2-(7-Chlorobenzoxazol-2-yl)ethyl]-5-ethyl-6-methylpyridin-2(1H)-one::3-[2-(7-chloro-1,3-benzoxazol-2-yl)ethyl]-5-ethyl-6-methyl-1,2-dihydropyridin-2-one::CHEMBL171920
SMILES: CCc1cc(CCc2nc3cccc(Cl)c3o2)c(=O)[nH]c1C
InChI Key: InChIKey=UIGJYHSYHVEEOI-UHFFFAOYSA-N
Data: 2 IC50
Activity Spreadsheet -- Enzyme Inhibition Constant Data from BindingDB
Found 2 hits for monomerid = 2238
Trg + Lig
Ki
nM
ΔG°
kcal/mole
IC50
nM
Kd
nM
EC50/IC50
nM
koff
s-1
kon
M-1s-1
pHTemp
°C
Human immunodeficiency virus type 1 reverse transcriptase
(Human immunodeficiency virus 1)
BDBM2238
(2-Pyridinone derivative 18 | 3-[2-(7-Chlorobenzoxa...)
Show SMILES CCc1cc(CCc2nc3cccc(Cl)c3o2)c(=O)[nH]c1C
Show InChI InChI=1S/C17H17ClN2O2/c1-3-11-9-12(17(21)19-10(11)2)7-8-15-20-14-6-4-5-13(18)16(14)22-15/h4-6,9H,3,7-8H2,1-2H3,(H,19,21)
n/an/a 39n/an/an/an/an/an/a
Merck Reserch Laboratories
Curated by ChEMBL
Assay Description
Tested for inhibition against HIV-1 RT (used (poly)rC-(oligo)dG as the template)
J Med Chem 36: 953-66 (1993)
BindingDB Entry DOI: 10.7270/Q2JW8G28
HIV-1 Reverse Transcriptase
(Human immunodeficiency virus type 1)
BDBM2238
(2-Pyridinone derivative 18 | 3-[2-(7-Chlorobenzoxa...)
Show SMILES CCc1cc(CCc2nc3cccc(Cl)c3o2)c(=O)[nH]c1C
Show InChI InChI=1S/C17H17ClN2O2/c1-3-11-9-12(17(21)19-10(11)2)7-8-15-20-14-6-4-5-13(18)16(14)22-15/h4-6,9H,3,7-8H2,1-2H3,(H,19,21)
n/an/a 39n/an/an/an/an/an/a
Merck Reserch Laboratories
Curated by ChEMBL
Assay Description
The IC50 of reverse transcriptase is the concentration that inhibits 50% of recombinant HIV-1 RT RNA-directed DNA polymerase activity in vitro.
J Med Chem 36: 953-66 (1993)
BindingDB Entry DOI: 10.7270/Q2JW8G28