BDBM224029 Morphine-3-glucuronide::Morphine-3G
SMILES: [H][C@@]12Oc3c4c(C[C@H]5N(C)CC[C@@]14[C@@]5([H])C=C[C@@H]2O)ccc3O[C@@H]1O[C@@H]([C@@H](O)[C@H](O)[C@H]1O)C(O)=O
InChI Key: InChIKey=WAEXKFONHRHFBZ-ZXDZBKESSA-N
Data: 1 EC50
Activity Spreadsheet -- Enzyme Inhibition Constant Data from BindingDB
Found 1 hit for monomerid = 224029
Trg + Lig
Ki
nM
ΔG°
kcal/mole
IC50
nM
Kd
nM
EC50/IC50
nM
koff
s-1
kon
M-1s-1
pHTemp
°C
Mas-related G protein-coupled receptor X2 (MRGPRX2)
(Homo sapiens (Human))
BDBM224029
(Morphine-3-glucuronide | Morphine-3G)
Show SMILES [H][C@@]12Oc3c4c(C[C@H]5N(C)CC[C@@]14[C@@]5([H])C=C[C@@H]2O)ccc3O[C@@H]1O[C@@H]([C@@H](O)[C@H](O)[C@H]1O)C(O)=O |c:18|
Show InChI InChI=1S/C23H27NO9/c1-24-7-6-23-10-3-4-12(25)20(23)32-18-13(5-2-9(14(18)23)8-11(10)24)31-22-17(28)15(26)16(27)19(33-22)21(29)30/h2-5,10-12,15-17,19-20,22,25-28H,6-8H2,1H3,(H,29,30)/t10-,11+,12-,15-,16-,17+,19-,20-,22+,23-/m0/s1
n/an/an/an/a 2.80E+4n/an/a7.430
University of North Carolina
Assay Description
HTLA cells (HEK-T cells stably expressing a β-arrestin2-TEV fusion protein and a tTa-dependent luciferase reporter) were maintained in DMEM (Cor...
Nat Chem Biol 13: 529-536 (2017)
Article DOI: 10.1038/nchembio.2334
BindingDB Entry DOI: 10.7270/Q20R9N82