BDBM22406 2-[(1R,2S,3S,5S)-3-(4-chlorophenyl)-8-methyl-8-azabicyclo[3.2.1]octan-2-yl]-5-(3,4-dichlorophenyl)-1,3-thiazole::WIN 35,065-2 Analogue, 4i
SMILES: CN1[C@H]2CC[C@@H]1[C@H]([C@H](C2)c1ccc(Cl)cc1)c1ncc(s1)-c1ccc(Cl)c(Cl)c1
InChI Key: InChIKey=MQFVMWBVJNBDJG-CIBWYJFOSA-N
Data: 5 KI  1 IC50  3 EC50
Activity Spreadsheet -- Enzyme Inhibition Constant Data from BindingDB
Found 6 hits for monomerid = 22406
Trg + Lig
Ki
nM
ΔG°
kcal/mole
IC50
nM
Kd
nM
EC50/IC50
nM
koff
s-1
kon
M-1s-1
pHTemp
°C
Sodium-dependent dopamine transporter
(Homo sapiens (Human))
BDBM22406
(2-[(1R,2S,3S,5S)-3-(4-chlorophenyl)-8-methyl-8-aza...)
Show SMILES CN1[C@H]2CC[C@@H]1[C@H]([C@H](C2)c1ccc(Cl)cc1)c1ncc(s1)-c1ccc(Cl)c(Cl)c1 |TLB:0:1:4.3:7.8.6|
Show InChI InChI=1S/C23H21Cl3N2S/c1-28-16-7-9-20(28)22(17(11-16)13-2-5-15(24)6-3-13)23-27-12-21(29-23)14-4-8-18(25)19(26)10-14/h2-6,8,10,12,16-17,20,22H,7,9,11H2,1H3/t16-,17+,20+,22-/m0/s1
NCI pathway
Reactome pathway
66n/an/an/a 416n/an/an/an/a
Research Triangle Institute
Assay Description
Membranes were preincubated with drugs before the addition of [125I]RTI-55. The reaction was terminated by filtration through Wallac Filtermat A filt...
J Med Chem 50: 3686-95 (2007)
Article DOI: 10.1021/jm0703035
BindingDB Entry DOI: 10.7270/Q25D8Q4T
Sodium-dependent serotonin transporter
(Rattus norvegicus (rat))
BDBM22406
(2-[(1R,2S,3S,5S)-3-(4-chlorophenyl)-8-methyl-8-aza...)
Show SMILES CN1[C@H]2CC[C@@H]1[C@H]([C@H](C2)c1ccc(Cl)cc1)c1ncc(s1)-c1ccc(Cl)c(Cl)c1 |TLB:0:1:4.3:7.8.6|
Show InChI InChI=1S/C23H21Cl3N2S/c1-28-16-7-9-20(28)22(17(11-16)13-2-5-15(24)6-3-13)23-27-12-21(29-23)14-4-8-18(25)19(26)10-14/h2-6,8,10,12,16-17,20,22H,7,9,11H2,1H3/t16-,17+,20+,22-/m0/s1
380 -8.75n/an/an/an/an/a7.425
Research Triangle Institute
Assay Description
Brains from male Sprague-Dawley rats were removed, dissected, and rapidly frozen. Ligand binding experiments were conducted in assay tubes containing...
J Med Chem 50: 3686-95 (2007)
Article DOI: 10.1021/jm0703035
BindingDB Entry DOI: 10.7270/Q25D8Q4T
Transporter
(Rattus norvegicus (rat))
BDBM22406
(2-[(1R,2S,3S,5S)-3-(4-chlorophenyl)-8-methyl-8-aza...)
Show SMILES CN1[C@H]2CC[C@@H]1[C@H]([C@H](C2)c1ccc(Cl)cc1)c1ncc(s1)-c1ccc(Cl)c(Cl)c1 |TLB:0:1:4.3:7.8.6|
Show InChI InChI=1S/C23H21Cl3N2S/c1-28-16-7-9-20(28)22(17(11-16)13-2-5-15(24)6-3-13)23-27-12-21(29-23)14-4-8-18(25)19(26)10-14/h2-6,8,10,12,16-17,20,22H,7,9,11H2,1H3/t16-,17+,20+,22-/m0/s1
Reactome pathway
>2.00E+3n/an/an/an/an/an/an/an/a
Research Triangle Institute
Assay Description
Brains from male Sprague-Dawley rats were removed, dissected, and rapidly frozen. Ligand binding experiments were conducted in assay tubes containing...
J Med Chem 50: 3686-95 (2007)
Article DOI: 10.1021/jm0703035
BindingDB Entry DOI: 10.7270/Q25D8Q4T
Sodium-dependent noradrenaline transporter
(Homo sapiens (Human))
BDBM22406
(2-[(1R,2S,3S,5S)-3-(4-chlorophenyl)-8-methyl-8-aza...)
Show SMILES CN1[C@H]2CC[C@@H]1[C@H]([C@H](C2)c1ccc(Cl)cc1)c1ncc(s1)-c1ccc(Cl)c(Cl)c1 |TLB:0:1:4.3:7.8.6|
Show InChI InChI=1S/C23H21Cl3N2S/c1-28-16-7-9-20(28)22(17(11-16)13-2-5-15(24)6-3-13)23-27-12-21(29-23)14-4-8-18(25)19(26)10-14/h2-6,8,10,12,16-17,20,22H,7,9,11H2,1H3/t16-,17+,20+,22-/m0/s1
Reactome pathway
2.30E+3n/an/an/a 6.50E+3n/an/an/an/a
Research Triangle Institute
Assay Description
Membranes were preincubated with drugs before the addition of [125I]RTI-55. The reaction was terminated by filtration through Wallac Filtermat A filt...
J Med Chem 50: 3686-95 (2007)
Article DOI: 10.1021/jm0703035
BindingDB Entry DOI: 10.7270/Q25D8Q4T
Sodium-dependent serotonin transporter
(Homo sapiens (Human))
BDBM22406
(2-[(1R,2S,3S,5S)-3-(4-chlorophenyl)-8-methyl-8-aza...)
Show SMILES CN1[C@H]2CC[C@@H]1[C@H]([C@H](C2)c1ccc(Cl)cc1)c1ncc(s1)-c1ccc(Cl)c(Cl)c1 |TLB:0:1:4.3:7.8.6|
Show InChI InChI=1S/C23H21Cl3N2S/c1-28-16-7-9-20(28)22(17(11-16)13-2-5-15(24)6-3-13)23-27-12-21(29-23)14-4-8-18(25)19(26)10-14/h2-6,8,10,12,16-17,20,22H,7,9,11H2,1H3/t16-,17+,20+,22-/m0/s1
2.71E+3n/an/an/a 5.30E+3n/an/an/an/a
Research Triangle Institute
Assay Description
Membranes were preincubated with drugs before the addition of [125I]RTI-55. The reaction was terminated by filtration through Wallac Filtermat A filt...
J Med Chem 50: 3686-95 (2007)
Article DOI: 10.1021/jm0703035
BindingDB Entry DOI: 10.7270/Q25D8Q4T
Sodium-dependent dopamine transporter
(Rattus norvegicus (rat))
BDBM22406
(2-[(1R,2S,3S,5S)-3-(4-chlorophenyl)-8-methyl-8-aza...)
Show SMILES CN1[C@H]2CC[C@@H]1[C@H]([C@H](C2)c1ccc(Cl)cc1)c1ncc(s1)-c1ccc(Cl)c(Cl)c1 |TLB:0:1:4.3:7.8.6|
Show InChI InChI=1S/C23H21Cl3N2S/c1-28-16-7-9-20(28)22(17(11-16)13-2-5-15(24)6-3-13)23-27-12-21(29-23)14-4-8-18(25)19(26)10-14/h2-6,8,10,12,16-17,20,22H,7,9,11H2,1H3/t16-,17+,20+,22-/m0/s1
Reactome pathway
n/an/a 440n/an/an/an/a7.44
Research Triangle Institute
Assay Description
Brains from male Sprague-Dawley rats were removed, dissected, and rapidly frozen. Ligand binding experiments were conducted in assay tubes containing...
J Med Chem 50: 3686-95 (2007)
Article DOI: 10.1021/jm0703035
BindingDB Entry DOI: 10.7270/Q25D8Q4T