BDBM22425 (4Z)-5-{4-[2-(dimethylamino)ethoxy]phenyl}-5-(4-hydroxyphenyl)-4-phenylpent-4-enenitrile::4-hydroxytamoxifen (4-OHT) analog, 5
SMILES: CN(C)CCOc1ccc(cc1)C(=C(\CCC#N)c1ccccc1)\c1ccc(O)cc1
InChI Key: InChIKey=NJLBAPRPXSPJQO-RQZHXJHFSA-N
Data: 2 IC50
Activity Spreadsheet -- Enzyme Inhibition Constant Data from BindingDB
Found 2 hits for monomerid = 22425
Trg + Lig
Ki
nM
ΔG°
kcal/mole
IC50
nM
Kd
nM
EC50/IC50
nM
koff
s-1
kon
M-1s-1
pHTemp
°C
Estrogen-Related Receptor, gamma
(Homo sapiens (Human))
BDBM22425
((4Z)-5-{4-[2-(dimethylamino)ethoxy]phenyl}-5-(4-hy...)
Show SMILES CN(C)CCOc1ccc(cc1)C(=C(\CCC#N)c1ccccc1)\c1ccc(O)cc1
Show InChI InChI=1S/C27H28N2O2/c1-29(2)19-20-31-25-16-12-23(13-17-25)27(22-10-14-24(30)15-11-22)26(9-6-18-28)21-7-4-3-5-8-21/h3-5,7-8,10-17,30H,6,9,19-20H2,1-2H3/b27-26-
Reactome pathway
n/an/a 1.30E+3n/an/an/an/a7.422
GSK
Assay Description
Binding affinity was measured by a scintillation proximity binding assay using [3H]4-OHT (for ERRgamma) or [3H]estradiol (for ERalpha) as radioligand...
Bioorg Med Chem Lett 16: 821-4 (2006)
Article DOI: 10.1016/j.bmcl.2005.11.030
BindingDB Entry DOI: 10.7270/Q2WW7FZ7
3D
3D Structure (docked)
Estrogen receptor
(Homo sapiens (Human))
BDBM22425
((4Z)-5-{4-[2-(dimethylamino)ethoxy]phenyl}-5-(4-hy...)
Show SMILES CN(C)CCOc1ccc(cc1)C(=C(\CCC#N)c1ccccc1)\c1ccc(O)cc1
Show InChI InChI=1S/C27H28N2O2/c1-29(2)19-20-31-25-16-12-23(13-17-25)27(22-10-14-24(30)15-11-22)26(9-6-18-28)21-7-4-3-5-8-21/h3-5,7-8,10-17,30H,6,9,19-20H2,1-2H3/b27-26-
n/an/a 200n/an/an/an/a7.422
GSK
Assay Description
Binding affinity was measured by a scintillation proximity binding assay using [3H]4-OHT (for ERRgamma) or [3H]estradiol (for ERalpha) as radioligand...
Bioorg Med Chem Lett 16: 821-4 (2006)
Article DOI: 10.1016/j.bmcl.2005.11.030
BindingDB Entry DOI: 10.7270/Q2WW7FZ7